{"text_format":"1","workbook":"xlsx","n_sheets":5,"sheets":["CALC","CALCF","Información","FUTUROS ESPECIFICOS","calendario"],"not_rendered":{"charts":0,"images":3,"macros":1,"external_links":0,"defined_names":60,"comments":0,"pivot_tables":0},"unopened":[],"bounds":{"document_bytes":16777216,"sheet_cells":100000,"rows_first":2000,"rows_last":500,"rows_between":2000,"halvings":0,"cell_chars":16384,"cell_head_chars":4096},"cells_cut":0,"cells_raw":0,"read":"whole","date_system":"1900"}

{"sheet":"CALC","index":0,"n_rows":60,"n_cols":17,"rows_kept":60,"cut":false,"hidden":true,"merged":[]}
["Emision","JN21",null,null,"Fecha Fin","Dxv","Plazo Cupon","Flujo Cupón","Amort","VP",null,null,null,null,null,"Fecha Fin Fung","Fecha Fin No Fung"]
["Contrato","DC16",null,null,{"$f":"IF($B$1=\"MR26\",Q2,P2)","v":"2013-12-19"},{"$f":"IF(OR(E2-$B$3<=0,E2>$B$4),\"\",E2-$B$3)","v":""},null,null,null,null,null,null,null,null,null,"2013-12-19","2016-09-15"]
["Fecha Valuación",{"$f":"DIA_VALUACION","v":"2016-11-09"},null,{"$f":"IF(F3=MIN($F:$F),\"VIG\",\"\")","v":""},{"$f":"IF($B$1=\"MR26\",Q3,P3)","v":"2014-06-19"},"",{"$f":"IF(E3-E2<0,0,E3-E2)","v":182},{"$f":"IF(F3<=0,0,$B$6/36000*G3*100)","v":3.286111111111111},{"$f":"IF(F3=MAX($F:$F),100,0)","v":0},{"$f":"IF(F3=\"\",0,(H3+I3)/(1+$B$7*182/36000)^(F3/182))","v":0},null,{"$f":"IF(F3=\"\",\"\",IF(F3=MIN($F:$F),1,L2+1))","v":""},{"$f":"IFERROR(H3/(1+$B$11*F3/36000)+SUM($M$2:$M2),0)","v":0},null,null,"2014-06-19","2017-03-16"]
["Vencimiento",{"$f":"VLOOKUP($B$1,CTOS_CASH,2,0)","v":"2021-06-10"},null,{"$f":"IF(F4=MIN($F:$F),\"VIG\",\"\")","v":""},"2014-12-18","",{"$f":"IF(E4-E3<0,0,E4-E3)","v":182},3.286111111111111,{"$f":"IF(F4=MAX($F:$F),100,0)","v":0},0,{"$f":"IFERROR(H4/(1+$B$11*F4/36000),\"\")","v":""},"",{"$f":"IFERROR(H4/(1+$B$11*F4/36000)+SUM($M$2:$M3),0)","v":0},null,null,"2014-12-18","2017-09-14"]
["Venc. Futuro",{"$f":"VLOOKUP($B$2,CTOS_FUT,2,0)","v":"2016-12-30"},null,"","2015-06-18","",182,3.286111111111111,0,0,"","",{"$f":"IFERROR(H5/(1+$B$11*F5/36000)+SUM($M$2:$M4),0)","v":0},null,null,"2015-06-18","2018-03-15"]
["Tasa Cupón",{"$f":"VLOOKUP($B$1,CTOS_CASH,3,0)","v":6.5},null,"","2015-12-17","",182,3.286111111111111,0,0,{"$f":"IFERROR(H6/(1+$B$11*F6/36000),\"\")","v":""},"",{"$f":"IFERROR(H6/(1+$B$11*F6/36000)+SUM($M$2:$M5),0)","v":0},null,null,"2015-12-17","2018-09-13"]
["Tasa Yield",5,null,"","2016-06-16","",182,3.286111111111111,0,0,"","",{"$f":"IFERROR(H7/(1+$B$11*F7/36000)+SUM($M$2:$M6),0)","v":0},null,null,"2016-06-16","2019-03-14"]
["Precio Sucio",{"$f":"SUM($J:$J)","v":108.78428457299981},null,"VIG","2016-12-15",36,182,3.286111111111111,0,3.2699247807601557,3.2697485081066517,1,{"$f":"IFERROR(H8/(1+$B$11*F8/36000)+SUM($M$2:$M7),0)","v":3.2697485081066517},null,null,"2016-12-15","2019-09-12"]
["Precio Limpio",{"$f":"+B8-B10","v":106.1481734618887},null,"","2017-06-15",218,182,3.286111111111111,0,3.1893062071895315,3.1894594935050726,2,{"$f":"IFERROR(H9/(1+$B$11*F9/36000)+SUM($M$2:$M8),0)","v":6.4592080016117244},null,null,"2017-06-15","2020-03-12"]
["Intereses",{"$f":"100*$B$6/36000*(VLOOKUP(\"VIG\",$D:$G,4,0)-VLOOKUP(\"VIG\",$D:$G,3,0))","v":2.6361111111111111},null,"","2017-12-14",400,182,3.286111111111111,0,3.1106752494939891,3.1130189885527106,3,{"$f":"IFERROR(H10/(1+$B$11*F10/36000)+SUM($M$2:$M9),0)","v":12.841975498271086},null,null,"2017-12-14","2020-09-10"]
["Fondeo",{"$f":"VLOOKUP($B$2,TABLA_FONDEO,3,0)","v":5.0042390000000001},null,"","2018-06-14",582,182,3.286111111111111,0,3.0339829038684267,3.0401567626659247,4,{"$f":"IFERROR(H11/(1+$B$11*F11/36000)+SUM($M$2:$M10),0)","v":25.611088770655385},null,null,"2018-06-14","2021-03-11"]
["Cupones",{"$f":"VLOOKUP($B$2,CTOS_FUT,3,0)","v":1},null,"","2018-12-13",764,182,3.286111111111111,0,2.9591813746752464,2.9706273063357158,5,{"$f":"IFERROR(H12/(1+$B$11*F12/36000)+SUM($M$2:$M11),0)","v":51.152648084980562},null,null,"2018-12-13","2021-09-09"]
["VP Cupón",{"$f":"IFERROR(VLOOKUP($B$12,$L:$M,2,0),0)","v":3.2697485081066517},null,"","2019-06-13",946,182,3.286111111111111,0,2.8862240446575149,2.9042070674358977,6,{"$f":"IFERROR(H13/(1+$B$11*F13/36000)+SUM($M$2:$M12),0)","v":102.2388759310613},null,null,"2019-06-13","2022-03-10"]
["DXV FUT",{"$f":"+B5-B3","v":51},null,"","2019-12-11",1127,181,3.2680555555555553,0,2.7999820795862296,2.8254233686848407,7,{"$f":"IFERROR(H14/(1+$B$11*F14/36000)+SUM($M$2:$M13),0)","v":204.39896816337156},null,null,"2019-12-11","2022-09-08"]
["Acarreo",{"$f":"(B8-B13)*(1+B11*B14/36000)","v":106.26256433652051},null,"","2020-06-11",1310,183,3.3041666666666663,0,2.7607472821475807,2.7951698747384319,8,{"$f":"IFERROR(H15/(1+$B$11*F15/36000)+SUM($M$2:$M14),0)","v":408.76768283279665},null,null,"2020-06-11","2023-03-09"]
["Tasa Yield",{"$f":"CALCF!B4","v":5.0099433389907251},null,"","2020-12-10",1492,182,3.286111111111111,0,2.6779681476921344,2.7216471859840605,9,{"$f":"IFERROR(H16/(1+$B$11*F16/36000)+SUM($M$2:$M15),0)","v":817.46184297683885},null,null,"2020-12-10","2023-09-07"]
[null,null,null,"","2021-06-10",1674,182,3.286111111111111,100,82.096292502929003,2.6657895724123564,10,{"$f":"IFERROR(H17/(1+$B$11*F17/36000)+SUM($M$2:$M16),0)","v":1634.8678283401061},null,null,"2021-06-10","2024-03-07"]
[null,null,null,"","2021-12-09","",182,3.286111111111111,0,0,"","",{"$f":"IFERROR(H18/(1+$B$11*F18/36000)+SUM($M$2:$M17),0)","v":0},null,null,"2021-12-09","2024-09-05"]
[null,null,null,"","2022-06-09","",182,3.286111111111111,0,0,"","",{"$f":"IFERROR(H19/(1+$B$11*F19/36000)+SUM($M$2:$M18),0)","v":0},null,null,"2022-06-09","2025-03-06"]
[null,null,null,"","2022-12-08","",182,3.286111111111111,0,0,"","",{"$f":"IFERROR(H20/(1+$B$11*F20/36000)+SUM($M$2:$M19),0)","v":0},null,null,"2022-12-08","2025-09-04"]
[null,null,null,"","2023-06-08","",182,3.286111111111111,0,0,"","",{"$f":"IFERROR(H21/(1+$B$11*F21/36000)+SUM($M$2:$M20),0)","v":0},null,null,"2023-06-08","2026-03-05"]
[null,null,null,"","2023-12-07","",182,3.286111111111111,0,0,"","",{"$f":"IFERROR(H22/(1+$B$11*F22/36000)+SUM($M$2:$M21),0)","v":0},null,null,"2023-12-07"]
[null,null,null,"","2024-06-06","",182,3.286111111111111,0,0,"","",{"$f":"IFERROR(H23/(1+$B$11*F23/36000)+SUM($M$2:$M22),0)","v":0},null,null,"2024-06-06"]
[null,null,null,"","2024-12-05","",182,3.286111111111111,0,0,"","",{"$f":"IFERROR(H24/(1+$B$11*F24/36000)+SUM($M$2:$M23),0)","v":0},null,null,"2024-12-05"]
[null,null,null,"","2025-06-05","",182,3.286111111111111,0,0,"","",{"$f":"IFERROR(H25/(1+$B$11*F25/36000)+SUM($M$2:$M24),0)","v":0},null,null,"2025-06-05"]
[null,null,null,"","2025-12-04","",182,3.286111111111111,0,0,"","",{"$f":"IFERROR(H26/(1+$B$11*F26/36000)+SUM($M$2:$M25),0)","v":0},null,null,"2025-12-04"]
[null,null,null,"","2026-06-04","",182,3.286111111111111,0,0,"","",{"$f":"IFERROR(H27/(1+$B$11*F27/36000)+SUM($M$2:$M26),0)","v":0},null,null,"2026-06-04"]
[null,null,null,"","2026-12-03","",182,3.286111111111111,0,0,"","",{"$f":"IFERROR(H28/(1+$B$11*F28/36000)+SUM($M$2:$M27),0)","v":0},null,null,"2026-12-03"]
[null,null,null,"","2027-06-03","",182,3.286111111111111,0,0,"","",{"$f":"IFERROR(H29/(1+$B$11*F29/36000)+SUM($M$2:$M28),0)","v":0},null,null,"2027-06-03"]
[null,null,null,"","2027-12-02","",182,3.286111111111111,0,0,"","",{"$f":"IFERROR(H30/(1+$B$11*F30/36000)+SUM($M$2:$M29),0)","v":0},null,null,"2027-12-02"]
[null,null,null,"","2028-06-01","",182,3.286111111111111,0,0,"","",{"$f":"IFERROR(H31/(1+$B$11*F31/36000)+SUM($M$2:$M30),0)","v":0},null,null,"2028-06-01"]
[null,null,null,"","2028-11-30","",182,3.286111111111111,0,0,"","",{"$f":"IFERROR(H32/(1+$B$11*F32/36000)+SUM($M$2:$M31),0)","v":0},null,null,"2028-11-30"]
[null,null,null,"","2029-05-31","",182,3.286111111111111,0,0,"","",{"$f":"IFERROR(H33/(1+$B$11*F33/36000)+SUM($M$2:$M32),0)","v":0},null,null,"2029-05-31"]
[null,null,null,"","2029-11-29",{"$f":"IF(OR(E34-$B$3<=0,E34>$B$4),\"\",E34-$B$3)","v":""},182,3.286111111111111,0,0,"","",{"$f":"IFERROR(H34/(1+$B$11*F34/36000)+SUM($M$2:$M33),0)","v":0},null,null,"2029-11-29"]
[null,null,null,"","2030-05-30","",182,{"$f":"IF(F35<=0,0,$B$6/36000*G35*100)","v":3.286111111111111},0,{"$f":"IF(F35=\"\",0,(H35+I35)/(1+$B$7*182/36000)^(F35/182))","v":0},"",{"$f":"IF(F35=\"\",\"\",IF(F35=MIN($F:$F),1,L34+1))","v":""},{"$f":"IFERROR(H35/(1+$B$11*F35/36000)+SUM($M$2:$M34),0)","v":0},null,null,"2030-05-30"]
[null,null,null,"","2030-11-28","",182,3.286111111111111,0,0,{"$f":"IFERROR(H36/(1+$B$11*F36/36000),\"\")","v":""},"",{"$f":"IFERROR(H36/(1+$B$11*F36/36000)+SUM($M$2:$M35),0)","v":0},null,null,"2030-11-28"]
[null,null,null,"","2031-05-29","",182,3.286111111111111,0,0,"","",{"$f":"IFERROR(H37/(1+$B$11*F37/36000)+SUM($M$2:$M36),0)","v":0},null,null,"2031-05-29"]
[null,null,null,"","2031-11-27","",182,3.286111111111111,0,0,"","",{"$f":"IFERROR(H38/(1+$B$11*F38/36000)+SUM($M$2:$M37),0)","v":0},null,null,"2031-11-27"]
[null,null,null,"","2032-05-27","",182,3.286111111111111,0,0,"","",{"$f":"IFERROR(H39/(1+$B$11*F39/36000)+SUM($M$2:$M38),0)","v":0},null,null,"2032-05-27"]
[null,null,null,"","2032-11-25","",182,3.286111111111111,0,0,"","",{"$f":"IFERROR(H40/(1+$B$11*F40/36000)+SUM($M$2:$M39),0)","v":0},null,null,"2032-11-25"]
{"$rows_left_out":21}
{"sheet":"CALCF","index":1,"n_rows":60,"n_cols":17,"rows_kept":60,"cut":false,"hidden":true,"merged":[]}
["Fecha Valuación",{"$f":"+CALC!B5","v":"2016-12-30"},null,null,"Fecha Fin","Dxv","Plazo Cupon",null,null,null,null,null,null,null,null,"Fecha Fin Fung","Fecha Fin No Fung"]
["Vencimiento",{"$f":"+CALC!B4","v":"2021-06-10"},null,null,{"$f":"IF(CALC!$B$1=\"MR26\",Q2,P2)","v":"2013-12-19"},{"$f":"IF(OR(E2-$B$1<=0,E2>$B$2),\"\",E2-$B$1)","v":""},null,null,null,null,null,null,null,null,null,"2013-12-19","2016-09-15"]
["Tasa Cupón",{"$f":"+CALC!B6","v":6.5},null,{"$f":"IF(F3=MIN($F:$F),\"VIG\",\"\")","v":""},{"$f":"IF(CALC!$B$1=\"MR26\",Q3,P3)","v":"2014-06-19"},"",{"$f":"IF(E3-E2<0,0,E3-E2)","v":182},null,null,null,null,null,null,null,null,"2014-06-19","2017-03-16"]
["Tasa Yield",5.0099433389907251,null,"",{"$f":"IF(CALC!$B$1=\"MR26\",Q4,P4)","v":"2014-12-18"},"",{"$f":"IF(E4-E3<0,0,E4-E3)","v":182},{"$f":"IF(F4<=0,0,IF(F4=MAX($F:$F),$B$3/36000*G4*100+100,$B$3/36000*G4*100))","v":3.286111111111111},{"$f":"IF(F4=\"\",0,H4/(1+$B$4*182/36000)^(F4/182))","v":0},null,null,null,null,null,null,"2014-12-18","2017-09-14"]
["Precio Sucio",{"$f":"SUM(I:I)","v":106.21395739703382},null,"",{"$f":"IF(CALC!$B$1=\"MR26\",Q5,P5)","v":"2015-06-18"},"",182,3.286111111111111,0,null,null,null,null,null,null,"2015-06-18","2018-03-15"]
[null,{"$f":"+B5-CALC!B15","v":-4.8606939486688816E-2},null,"",{"$f":"IF(CALC!$B$1=\"MR26\",Q6,P6)","v":"2015-12-17"},"",182,3.286111111111111,0,null,null,null,null,null,null,"2015-12-17","2018-09-13"]
[null,null,null,"",{"$f":"IF(CALC!$B$1=\"MR26\",Q7,P7)","v":"2016-06-16"},"",182,3.286111111111111,0,null,null,null,null,null,null,"2016-06-16","2019-03-14"]
[null,null,null,"",{"$f":"IF(CALC!$B$1=\"MR26\",Q8,P8)","v":"2016-12-15"},"",182,3.286111111111111,0,null,null,null,null,null,null,"2016-12-15","2019-09-12"]
[null,null,null,"VIG",{"$f":"IF(CALC!$B$1=\"MR26\",Q9,P9)","v":"2017-06-15"},167,182,3.286111111111111,3.2115500557858909,null,null,null,null,null,null,"2017-06-15","2020-03-12"]
[null,null,null,"",{"$f":"IF(CALC!$B$1=\"MR26\",Q10,P10)","v":"2017-12-14"},349,182,3.286111111111111,3.1322171138856385,null,null,null,null,null,null,"2017-12-14","2020-09-10"]
[null,null,null,"",{"$f":"IF(CALC!$B$1=\"MR26\",Q11,P11)","v":"2018-06-14"},531,182,3.286111111111111,3.0548438847599724,null,null,null,null,null,null,"2018-06-14","2021-03-11"]
[null,null,null,"",{"$f":"IF(CALC!$B$1=\"MR26\",Q12,P12)","v":"2018-12-13"},713,182,3.286111111111111,2.9793819588319015,null,null,null,null,null,null,"2018-12-13","2021-09-09"]
[null,null,null,"",{"$f":"IF(CALC!$B$1=\"MR26\",Q13,P13)","v":"2019-06-13"},895,182,3.286111111111111,2.9057841223563829,null,null,null,null,null,null,"2019-06-13","2022-03-10"]
[null,null,null,"",{"$f":"IF(CALC!$B$1=\"MR26\",Q14,P14)","v":"2019-12-11"},1076,181,3.2680555555555553,2.8188202447528696,null,null,null,null,null,null,"2019-12-11","2022-09-08"]
[null,null,null,"",{"$f":"IF(CALC!$B$1=\"MR26\",Q15,P15)","v":"2020-06-11"},1259,183,3.3041666666666663,2.7791844657923948,null,null,null,null,null,null,"2020-06-11","2023-03-09"]
[null,null,null,"",{"$f":"IF(CALC!$B$1=\"MR26\",Q16,P16)","v":"2020-12-10"},1441,182,3.286111111111111,2.6957203344259426,null,null,null,null,null,null,"2020-12-10","2023-09-07"]
[null,null,null,"",{"$f":"IF(CALC!$B$1=\"MR26\",Q17,P17)","v":"2021-06-10"},1623,182,103.28611111111111,82.636455216442826,null,null,null,null,null,null,"2021-06-10","2024-03-07"]
[null,null,null,"",{"$f":"IF(CALC!$B$1=\"MR26\",Q18,P18)","v":"2021-12-09"},"",182,3.286111111111111,0,null,null,null,null,null,null,"2021-12-09","2024-09-05"]
[null,null,null,"",{"$f":"IF(CALC!$B$1=\"MR26\",Q19,P19)","v":"2022-06-09"},"",182,3.286111111111111,0,null,null,null,null,null,null,"2022-06-09","2025-03-06"]
[null,null,null,"",{"$f":"IF(CALC!$B$1=\"MR26\",Q20,P20)","v":"2022-12-08"},"",182,3.286111111111111,0,null,null,null,null,null,null,"2022-12-08","2025-09-04"]
[null,null,null,"",{"$f":"IF(CALC!$B$1=\"MR26\",Q21,P21)","v":"2023-06-08"},"",182,3.286111111111111,0,null,null,null,null,null,null,"2023-06-08","2026-03-05"]
[null,null,null,"",{"$f":"IF(CALC!$B$1=\"MR26\",Q22,P22)","v":"2023-12-07"},"",182,3.286111111111111,0,null,null,null,null,null,null,"2023-12-07"]
[null,null,null,"",{"$f":"IF(CALC!$B$1=\"MR26\",Q23,P23)","v":"2024-06-06"},"",182,3.286111111111111,0,null,null,null,null,null,null,"2024-06-06"]
[null,null,null,"",{"$f":"IF(CALC!$B$1=\"MR26\",Q24,P24)","v":"2024-12-05"},"",182,3.286111111111111,0,null,null,null,null,null,null,"2024-12-05"]
[null,null,null,"",{"$f":"IF(CALC!$B$1=\"MR26\",Q25,P25)","v":"2025-06-05"},"",182,3.286111111111111,0,null,null,null,null,null,null,"2025-06-05"]
[null,null,null,"",{"$f":"IF(CALC!$B$1=\"MR26\",Q26,P26)","v":"2025-12-04"},"",182,3.286111111111111,0,null,null,null,null,null,null,"2025-12-04"]
[null,null,null,"",{"$f":"IF(CALC!$B$1=\"MR26\",Q27,P27)","v":"2026-06-04"},"",182,3.286111111111111,0,null,null,null,null,null,null,"2026-06-04"]
[null,null,null,"",{"$f":"IF(CALC!$B$1=\"MR26\",Q28,P28)","v":"2026-12-03"},"",182,3.286111111111111,0,null,null,null,null,null,null,"2026-12-03"]
[null,null,null,"",{"$f":"IF(CALC!$B$1=\"MR26\",Q29,P29)","v":"2027-06-03"},"",182,3.286111111111111,0,null,null,null,null,null,null,"2027-06-03"]
[null,null,null,"",{"$f":"IF(CALC!$B$1=\"MR26\",Q30,P30)","v":"2027-12-02"},"",182,3.286111111111111,0,null,null,null,null,null,null,"2027-12-02"]
[null,null,null,"",{"$f":"IF(CALC!$B$1=\"MR26\",Q31,P31)","v":"2028-06-01"},"",182,3.286111111111111,0,null,null,null,null,null,null,"2028-06-01"]
[null,null,null,"",{"$f":"IF(CALC!$B$1=\"MR26\",Q32,P32)","v":"2028-11-30"},"",182,3.286111111111111,0,null,null,null,null,null,null,"2028-11-30"]
[null,null,null,"",{"$f":"IF(CALC!$B$1=\"MR26\",Q33,P33)","v":"2029-05-31"},"",182,3.286111111111111,0,null,null,null,null,null,null,"2029-05-31"]
[null,null,null,"",{"$f":"IF(CALC!$B$1=\"MR26\",Q34,P34)","v":"2029-11-29"},{"$f":"IF(OR(E34-$B$1<=0,E34>$B$2),\"\",E34-$B$1)","v":""},182,3.286111111111111,0,null,null,null,null,null,null,"2029-11-29"]
[null,null,null,{"$f":"IF(F35=MIN($F:$F),\"VIG\",\"\")","v":""},{"$f":"IF(CALC!$B$1=\"MR26\",Q35,P35)","v":"2030-05-30"},"",182,{"$f":"IF(F35<=0,0,IF(F35=MAX($F:$F),$B$3/36000*G35*100+100,$B$3/36000*G35*100))","v":3.286111111111111},{"$f":"IF(F35=\"\",0,H35/(1+$B$4*182/36000)^(F35/182))","v":0},null,null,null,null,null,null,"2030-05-30"]
[null,null,null,"",{"$f":"IF(CALC!$B$1=\"MR26\",Q36,P36)","v":"2030-11-28"},"",182,3.286111111111111,0,null,null,null,null,null,null,"2030-11-28"]
[null,null,null,"",{"$f":"IF(CALC!$B$1=\"MR26\",Q37,P37)","v":"2031-05-29"},"",182,3.286111111111111,0,null,null,null,null,null,null,"2031-05-29"]
[null,null,null,"",{"$f":"IF(CALC!$B$1=\"MR26\",Q38,P38)","v":"2031-11-27"},"",182,3.286111111111111,0,null,null,null,null,null,null,"2031-11-27"]
[null,null,null,"",{"$f":"IF(CALC!$B$1=\"MR26\",Q39,P39)","v":"2032-05-27"},"",182,3.286111111111111,0,null,null,null,null,null,null,"2032-05-27"]
[null,null,null,"",{"$f":"IF(CALC!$B$1=\"MR26\",Q40,P40)","v":"2032-11-25"},"",182,3.286111111111111,0,null,null,null,null,null,null,"2032-11-25"]
{"$rows_left_out":21}
{"sheet":"Información","index":2,"n_rows":2000,"n_cols":10,"rows_kept":2000,"cut":false,"hidden":false,"merged":[]}
[1,4.82,null,null,"Contrato","Vencimiento","Cupón","Contrato","Vencimiento","# Cupones"]
[2,4.8253310000000003,null,null,"DC18","2018-12-13",8.5,"DC16","2016-12-30",1]
[3,4.8310579999999996,null,null,"JN21","2021-06-10",6.5,"MR17","2017-03-31",1]
[4,4.836786,null,null,"DC24","2024-12-05",10,"JN17","2017-06-30",2]
[5,4.8421159999999999,null,null,"MR26","2026-03-05",5.75,"SP17","2017-09-29",2]
[6,4.8466529999999999,null,null,"MY31","2031-05-29",7.75]
[7,4.8499999999999996,null,null,"NV42","2042-11-13",7.75]
[8,4.852303]
[9,4.8540720000000004]
[10,4.8554519999999997]
[11,4.8565889999999996]
[12,4.8576290000000002]
[13,4.8587170000000004]
[14,4.8600000000000003]
[15,4.8608450000000003]
[16,4.8609140000000002]
[17,4.8607870000000002]
[18,4.8610499999999996]
[19,4.8622839999999998]
[20,4.8650729999999998]
[21,4.87]
[22,4.8773400000000002]
[23,4.8864409999999996]
[24,4.8964920000000003]
[25,4.9066830000000001]
[26,4.9162049999999997]
[27,4.9242470000000003]
[28,4.93]
[29,4.9342819999999996]
[30,4.938453]
[31,4.9425150000000002]
[32,4.9464699999999997]
[33,4.9503199999999996]
[34,4.9540680000000004]
[35,4.9577159999999996]
[36,4.961265]
[37,4.9647189999999997]
[38,4.9680790000000004]
[39,4.9713469999999997]
[40,4.9745270000000001]
{"$rows_left_out":1961}
{"sheet":"FUTUROS ESPECIFICOS","index":3,"n_rows":58,"n_cols":21,"rows_kept":58,"cut":false,"hidden":false,"merged":[[1,15,1,16],[3,15,3,16]]}
["Contrato","YCash Bid","YFut Bid","Bid","Ask","Y F Ask","YCash Ask","Last","Tasa Fut","Tasa Cash",null,"BID","ASK","LAST",null,null,null,null,"Plazos","DXV","Fondeo"]
[{"$f":"\"DC18 \"&Información!$H$2","v":"DC18 DC16"},null,null,null,null,null,null,null,null,null,null,{"$f":"_xll.rtdValue(L$1,$A2,\"EMD\",\"MXN\")","v":""},{"$f":"_xll.rtdValue(M$1,$A2,\"EMD\",\"MXN\")","v":""},{"$f":"_xll.rtdValue(N$1,$A2,\"EMD\",\"MXN\")","v":""},null,"Fecha Valuación",null,null,{"$f":"+Información!H2","v":"DC16"},{"$f":"VLOOKUP(S2,CTOS_FUT,2,0)-'FUTUROS ESPECIFICOS'!$P$4","v":51},{"$f":"VLOOKUP(T2,Información!$A:$B,2,0)","v":5.0042390000000001}]
[null,null,null,null,null,null,null,null,null,null,null,null,null,null,null,null,null,null,null,null,3.22]
[{"$f":"\"DC18 \"&Información!$H$3","v":"DC18 MR17"},null,null,null,null,null,null,null,null,null,null,{"$f":"_xll.rtdValue(L$1,$A4,\"EMD\",\"MXN\")","v":""},{"$f":"_xll.rtdValue(M$1,$A4,\"EMD\",\"MXN\")","v":""},{"$f":"_xll.rtdValue(N$1,$A4,\"EMD\",\"MXN\")","v":""},null,{"$f":"WORKDAY(TODAY(),2,calendario!$A$1:$A$339)","v":"2016-11-09"},null,null,{"$f":"+Información!H3","v":"MR17"},{"$f":"VLOOKUP(S4,CTOS_FUT,2,0)-'FUTUROS ESPECIFICOS'!$P$4","v":142},{"$f":"VLOOKUP(T4,Información!$A:$B,2,0)","v":5.1329690000000001}]
[null,null,null,null,null,null,null,null,null,null,null,null,null,null,null,null,null,null,null,null,3.3458807199999998]
[{"$f":"\"DC18 \"&Información!$H$4","v":"DC18 JN17"},null,null,null,null,null,null,null,null,null,null,{"$f":"_xll.rtdValue(L$1,$A6,\"EMD\",\"MXN\")","v":""},{"$f":"_xll.rtdValue(M$1,$A6,\"EMD\",\"MXN\")","v":""},{"$f":"_xll.rtdValue(N$1,$A6,\"EMD\",\"MXN\")","v":""},null,null,null,null,{"$f":"+Información!H4","v":"JN17"},{"$f":"VLOOKUP(S6,CTOS_FUT,2,0)-'FUTUROS ESPECIFICOS'!$P$4","v":233},{"$f":"VLOOKUP(T6,Información!$A:$B,2,0)","v":5.2620899999999997}]
[null,null,null,null,null,null,null,null,null,null,null,null,null,null,null,null,null,null,null,null,3.59151833]
[{"$f":"\"DC18 \"&Información!$H$5","v":"DC18 SP17"},null,null,null,null,null,null,null,null,null,null,{"$f":"_xll.rtdValue(L$1,$A8,\"EMD\",\"MXN\")","v":""},{"$f":"_xll.rtdValue(M$1,$A8,\"EMD\",\"MXN\")","v":""},{"$f":"_xll.rtdValue(N$1,$A8,\"EMD\",\"MXN\")","v":""},null,null,null,null,{"$f":"+Información!H5","v":"SP17"},{"$f":"VLOOKUP(S8,CTOS_FUT,2,0)-'FUTUROS ESPECIFICOS'!$P$4","v":324},{"$f":"VLOOKUP(T8,Información!$A:$B,2,0)","v":5.4112799999999996}]
[null,null,null,null,null,null,null,null,null,null,null,null,null,null,null,null,null,null,null,null,3.6003676699999998]
[]
[]
[{"$f":"\"JN21 \"&Información!$H$2","v":"JN21 DC16"},null,null,null,null,null,null,null,null,null,null,{"$f":"_xll.rtdValue(L$1,$A12,\"EMD\",\"MXN\")","v":""},{"$f":"_xll.rtdValue(M$1,$A12,\"EMD\",\"MXN\")","v":""},{"$f":"_xll.rtdValue(N$1,$A12,\"EMD\",\"MXN\")","v":""}]
[]
[{"$f":"\"JN21 \"&Información!$H$3","v":"JN21 MR17"},null,null,null,null,null,null,null,null,null,null,{"$f":"_xll.rtdValue(L$1,$A14,\"EMD\",\"MXN\")","v":""},{"$f":"_xll.rtdValue(M$1,$A14,\"EMD\",\"MXN\")","v":""},{"$f":"_xll.rtdValue(N$1,$A14,\"EMD\",\"MXN\")","v":""}]
[]
[{"$f":"\"JN21 \"&Información!$H$4","v":"JN21 JN17"},null,null,null,null,null,null,null,null,null,null,{"$f":"_xll.rtdValue(L$1,$A16,\"EMD\",\"MXN\")","v":""},{"$f":"_xll.rtdValue(M$1,$A16,\"EMD\",\"MXN\")","v":""},{"$f":"_xll.rtdValue(N$1,$A16,\"EMD\",\"MXN\")","v":""}]
[]
[{"$f":"\"JN21 \"&Información!$H$5","v":"JN21 SP17"},null,null,null,null,null,null,null,null,null,null,{"$f":"_xll.rtdValue(L$1,$A18,\"EMD\",\"MXN\")","v":""},{"$f":"_xll.rtdValue(M$1,$A18,\"EMD\",\"MXN\")","v":""},{"$f":"_xll.rtdValue(N$1,$A18,\"EMD\",\"MXN\")","v":""}]
[]
[]
[]
[{"$f":"\"DC24 \"&Información!$H$2","v":"DC24 DC16"},null,null,null,null,null,null,null,null,null,null,{"$f":"_xll.rtdValue(L$1,$A22,\"EMD\",\"MXN\")","v":""},{"$f":"_xll.rtdValue(M$1,$A22,\"EMD\",\"MXN\")","v":""},{"$f":"_xll.rtdValue(N$1,$A22,\"EMD\",\"MXN\")","v":""}]
[]
[{"$f":"\"DC24 \"&Información!$H$3","v":"DC24 MR17"},null,null,null,null,null,null,null,null,null,null,{"$f":"_xll.rtdValue(L$1,$A24,\"EMD\",\"MXN\")","v":""},{"$f":"_xll.rtdValue(M$1,$A24,\"EMD\",\"MXN\")","v":""},{"$f":"_xll.rtdValue(N$1,$A24,\"EMD\",\"MXN\")","v":""}]
[]
[{"$f":"\"DC24 \"&Información!$H$4","v":"DC24 JN17"},null,null,null,null,null,null,null,null,null,null,{"$f":"_xll.rtdValue(L$1,$A26,\"EMD\",\"MXN\")","v":""},{"$f":"_xll.rtdValue(M$1,$A26,\"EMD\",\"MXN\")","v":""},{"$f":"_xll.rtdValue(N$1,$A26,\"EMD\",\"MXN\")","v":""}]
[]
[{"$f":"\"DC24 \"&Información!$H$5","v":"DC24 SP17"},null,null,null,null,null,null,null,null,null,null,{"$f":"_xll.rtdValue(L$1,$A28,\"EMD\",\"MXN\")","v":""},{"$f":"_xll.rtdValue(M$1,$A28,\"EMD\",\"MXN\")","v":""},{"$f":"_xll.rtdValue(N$1,$A28,\"EMD\",\"MXN\")","v":""}]
[]
[]
[]
[{"$f":"\"MR26 \"&Información!$H$2","v":"MR26 DC16"},null,null,null,null,null,null,null,null,null,null,{"$f":"_xll.rtdValue(L$1,$A32,\"EMD\",\"MXN\")","v":""},{"$f":"_xll.rtdValue(M$1,$A32,\"EMD\",\"MXN\")","v":""},{"$f":"_xll.rtdValue(N$1,$A32,\"EMD\",\"MXN\")","v":""}]
[]
[{"$f":"\"MR26 \"&Información!$H$3","v":"MR26 MR17"},null,null,null,null,null,null,null,null,null,null,{"$f":"_xll.rtdValue(L$1,$A34,\"EMD\",\"MXN\")","v":""},{"$f":"_xll.rtdValue(M$1,$A34,\"EMD\",\"MXN\")","v":""},{"$f":"_xll.rtdValue(N$1,$A34,\"EMD\",\"MXN\")","v":""}]
[]
[{"$f":"\"MR26 \"&Información!$H$4","v":"MR26 JN17"},null,null,null,null,null,null,null,null,null,null,{"$f":"_xll.rtdValue(L$1,$A36,\"EMD\",\"MXN\")","v":""},{"$f":"_xll.rtdValue(M$1,$A36,\"EMD\",\"MXN\")","v":""},{"$f":"_xll.rtdValue(N$1,$A36,\"EMD\",\"MXN\")","v":""}]
[]
[{"$f":"\"MR26 \"&Información!$H$5","v":"MR26 SP17"},null,null,null,null,null,null,null,null,null,null,{"$f":"_xll.rtdValue(L$1,$A38,\"EMD\",\"MXN\")","v":""},{"$f":"_xll.rtdValue(M$1,$A38,\"EMD\",\"MXN\")","v":""},{"$f":"_xll.rtdValue(N$1,$A38,\"EMD\",\"MXN\")","v":""}]
[]
[]
{"$rows_left_out":19}
{"sheet":"calendario","index":4,"n_rows":339,"n_cols":1,"rows_kept":339,"cut":false,"hidden":true,"merged":[]}
["2015-01-01"]
["2015-02-02"]
["2015-03-16"]
["2015-04-02"]
["2015-04-03"]
["2015-05-01"]
["2015-09-16"]
["2015-11-02"]
["2015-11-16"]
["2015-12-25"]
["2016-01-01"]
["2016-02-01"]
["2016-03-21"]
["2016-03-24"]
["2016-03-25"]
["2016-09-16"]
["2016-11-02"]
["2016-11-21"]
["2016-12-12"]
["2017-02-06"]
["2017-03-20"]
["2017-04-13"]
["2017-04-14"]
["2017-05-01"]
["2017-11-02"]
["2017-11-20"]
["2017-12-12"]
["2017-12-25"]
["2018-01-01"]
["2018-02-05"]
["2018-03-19"]
["2018-03-29"]
["2018-03-30"]
["2018-05-01"]
["2018-11-02"]
["2018-11-19"]
["2018-12-12"]
["2018-12-25"]
["2019-01-01"]
["2019-02-04"]
{"$rows_left_out":299}