{"text_format":"1","workbook":"xlsx","n_sheets":6,"sheets":["CALC","CALCF","Información","FUTUROS ESPECIFICOS","calendario","Entrega Anticipada"],"not_rendered":{"charts":0,"images":3,"macros":1,"external_links":0,"defined_names":60,"comments":1,"pivot_tables":0},"unopened":[],"bounds":{"document_bytes":16777216,"sheet_cells":100000,"rows_first":2000,"rows_last":500,"rows_between":2000,"halvings":0,"cell_chars":16384,"cell_head_chars":4096},"cells_cut":0,"cells_raw":0,"read":"whole","date_system":"1900"}

{"sheet":"CALC","index":0,"n_rows":70,"n_cols":19,"rows_kept":70,"cut":false,"hidden":true,"merged":[]}
["Emision","DC24","Contrato",null,"Fecha Fin","Dxv","Plazo Cupon","Flujo Cupón","Amort","VP",null,"Contador","VP Acum",null,null,"Fecha Fin Fung","Fecha Fin No Fung",null,{"$f":"\"DC18\"&Información!$H$2","v":"DC18MR22"}]
["Vencimiento","MR22","Vencimiento",null,{"$f":"IF(OR($B$1=\"MR26\",$B$1=\"SP24\"),Q2,P2)","v":"2013-12-19"},{"$f":"IF(OR(E2-$B$3<=0,E2>$B$4),\"\",E2-$B$3)","v":""},null,null,null,null,null,null,null,null,null,"2013-12-19","2016-09-15",null,{"$f":"\"DC18\"&Información!$H$3","v":"DC18JN22"}]
["Fecha Valuación",{"$f":"DIA_VALUACION","v":"2022-01-04"},null,{"$f":"IF(F3=MIN($F:$F),\"VIG\",\"\")","v":""},{"$f":"IF(OR($B$1=\"MR26\",$B$1=\"SP24\"),Q3,P3)","v":"2014-06-19"},{"$f":"IF(OR(E3-$B$3<=0,E3>$B$4),\"\",E3-$B$3)","v":""},{"$f":"IF(E3-E2<0,0,E3-E2)","v":182},{"$f":"IF(F3<=0,0,$B$6/36000*G3*100)","v":5.0555555555555554},{"$f":"IF(F3=MAX($F:$F),100,0)","v":0},{"$f":"IF(F3=\"\",0,(H3+I3)/(1+$B$7*182/36000)^(F3/182))","v":0},null,{"$f":"IF(F3=\"\",\"\",IF(F3=MIN($F:$F),1,L2+1))","v":""},{"$f":"IFERROR(H3/(1+$B$11*F3/36000)+SUM($M$2:$M2),0)","v":0},null,null,"2014-06-19","2017-03-16",null,{"$f":"\"DC18\"&Información!$H$4","v":"DC18SP22"}]
["Vencimiento",{"$f":"VLOOKUP($B$1,CTOS_CASH,2,0)","v":"2024-12-05"},null,{"$f":"IF(F4=MIN($F:$F),\"VIG\",\"\")","v":""},"2014-12-18",{"$f":"IF(OR(E4-$B$3<=0,E4>$B$4),\"\",E4-$B$3)","v":""},{"$f":"IF(E4-E3<0,0,E4-E3)","v":182},5.0555555555555554,{"$f":"IF(F4=MAX($F:$F),100,0)","v":0},0,{"$f":"IFERROR(H4/(1+$B$11*F4/36000),\"\")","v":""},"",{"$f":"IFERROR(H4/(1+$B$11*F4/36000)+SUM($M$2:$M3),0)","v":0},null,null,"2014-12-18","2017-09-14"]
["Venc. Futuro",{"$f":"VLOOKUP($B$2,CTOS_FUT,2,0)","v":"2022-03-31"},null,{"$f":"IF(F5=MIN($F:$F),\"VIG\",\"\")","v":""},"2015-06-18",{"$f":"IF(OR(E5-$B$3<=0,E5>$B$4),\"\",E5-$B$3)","v":""},{"$f":"IF(E5-E4<0,0,E5-E4)","v":182},5.0555555555555554,{"$f":"IF(F5=MAX($F:$F),100,0)","v":0},0,"","",{"$f":"IFERROR(H5/(1+$B$11*F5/36000)+SUM($M$2:$M4),0)","v":0},null,null,"2015-06-18","2018-03-15",null,{"$f":"\"JN21\"&Información!$H$2","v":"JN21MR22"}]
["Tasa Cupón",{"$f":"VLOOKUP($B$1,CTOS_CASH,3,0)","v":10},null,"","2015-12-17","",182,{"$f":"IF(F6<=0,0,$B$6/36000*G6*100)","v":5.0555555555555554},0,0,{"$f":"IFERROR(H6/(1+$B$11*F6/36000),\"\")","v":""},"",{"$f":"IFERROR(H6/(1+$B$11*F6/36000)+SUM($M$2:$M5),0)","v":0},null,null,"2015-12-17","2018-09-13",null,{"$f":"\"JN21\"&Información!$H$3","v":"JN21JN22"}]
["Tasa Yield",7.1621045878762857,null,"","2016-06-16","",182,5.0555555555555554,0,0,"","",{"$f":"IFERROR(H7/(1+$B$11*F7/36000)+SUM($M$2:$M6),0)","v":0},null,null,"2016-06-16","2019-03-14",null,{"$f":"\"JN21\"&Información!$H$4","v":"JN21SP22"}]
["Precio Sucio",{"$f":"SUM($J:$J)","v":108.16289753958607},null,{"$f":"IF(F8=MIN($F:$F),\"VIG\",\"\")","v":""},"2016-12-15","",182,5.0555555555555554,0,0,"","",{"$f":"IFERROR(H8/(1+$B$11*F8/36000)+SUM($M$2:$M7),0)","v":0},null,null,"2016-12-15","2019-09-12",null,{"$f":"\"JN21\"&Información!$H$5","v":"JN21DC22"}]
["Precio Limpio",{"$f":"+B8-B10","v":107.44067531736384},null,"","2017-06-15","",182,5.0555555555555554,0,0,"","",{"$f":"IFERROR(H9/(1+$B$11*F9/36000)+SUM($M$2:$M8),0)","v":0},null,null,"2017-06-15","2020-03-12"]
["Intereses",{"$f":"100*$B$6/36000*(VLOOKUP(\"VIG\",$D:$G,4,0)-VLOOKUP(\"VIG\",$D:$G,3,0))","v":0.72222222222222221},null,"","2017-12-14","",182,5.0555555555555554,0,0,"","",{"$f":"IFERROR(H10/(1+$B$11*F10/36000)+SUM($M$2:$M9),0)","v":0},null,null,"2017-12-14","2020-09-10",null,{"$f":"\"DC24\"&Información!$H$2","v":"DC24MR22"}]
["Fondeo",{"$f":"VLOOKUP($B$2,TABLA_FONDEO,3,0)","v":5.8039420000000002},null,{"$f":"IF(F11=MIN($F:$F),\"VIG\",\"\")","v":""},"2018-06-14",{"$f":"IF(OR(E11-$B$3<=0,E11>$B$4),\"\",E11-$B$3)","v":""},182,{"$f":"IF(F11<=0,0,$B$6/36000*G11*100)","v":5.0555555555555554},0,{"$f":"IF(F11=\"\",0,(H11+I11)/(1+$B$7*182/36000)^(F11/182))","v":0},{"$f":"IFERROR(H11/(1+$B$11*F11/36000),\"\")","v":""},{"$f":"IF(F11=\"\",\"\",IF(F11=MIN($F:$F),1,L10+1))","v":""},{"$f":"IFERROR(H11/(1+$B$11*F11/36000)+SUM($M$2:$M10),0)","v":0},null,null,"2018-06-14","2021-03-11",null,{"$f":"\"DC24\"&Información!$H$3","v":"DC24JN22"}]
["Cupones",{"$f":"TRUNC(($B$5-(VLOOKUP(\"VIG\",$D:$G,2,0)-VLOOKUP(\"VIG\",$D:$G,4,0)))/180,0)","v":0},null,"","2018-12-13",{"$f":"IF(OR(E12-$B$3<=0,E12>$B$4),\"\",E12-$B$3)","v":""},182,5.0555555555555554,0,{"$f":"IF(F12=\"\",0,(H12+I12)/(1+$B$7*182/36000)^(F12/182))","v":0},{"$f":"IFERROR(H12/(1+$B$11*F12/36000),\"\")","v":""},{"$f":"IF(F12=\"\",\"\",IF(F12=MIN($F:$F),1,L11+1))","v":""},{"$f":"IFERROR(H12/(1+$B$11*F12/36000)+SUM($M$2:$M11),0)","v":0},null,null,"2018-12-13","2021-09-09",null,{"$f":"\"DC24\"&Información!$H$4","v":"DC24SP22"}]
["VP Cupón",{"$f":"IFERROR(VLOOKUP($B$12,$L:$M,2,0),0)","v":0},null,"","2019-06-13","",{"$f":"IF(E13-E12<0,0,E13-E12)","v":182},5.0555555555555554,0,{"$f":"IF(F13=\"\",0,(H13+I13)/(1+$B$7*182/36000)^(F13/182))","v":0},{"$f":"IFERROR(H13/(1+$B$11*F13/36000),\"\")","v":""},"",{"$f":"IFERROR(H13/(1+$B$11*F13/36000)+SUM($M$2:$M12),0)","v":0},null,null,"2019-06-13","2022-03-10",null,{"$f":"\"DC24\"&Información!$H$5","v":"DC24DC22"}]
["DXV FUT",{"$f":"+B5-B3","v":86},null,"","2019-12-11","",181,5.0277777777777777,0,0,"","",{"$f":"IFERROR(H14/(1+$B$11*F14/36000)+SUM($M$2:$M13),0)","v":0},null,null,"2019-12-11","2022-09-08"]
["Acarreo",{"$f":"(B8-B13)*(1+B11*B14/36000)","v":109.6625731455018},null,"","2020-06-11","",183,5.083333333333333,0,{"$f":"IF(F15=\"\",0,(H15+I15)/(1+$B$7*182/36000)^(F15/182))","v":0},"","",{"$f":"IFERROR(H15/(1+$B$11*F15/36000)+SUM($M$2:$M14),0)","v":0},null,null,"2020-06-11","2023-03-09",null,{"$f":"\"MR26\"&Información!$H$2","v":"MR26MR22"}]
["Tasa Yield",{"$f":"CALCF!B4","v":7.3282505277249337},null,"","2020-12-10","",182,5.0555555555555554,0,0,"","",{"$f":"IFERROR(H16/(1+$B$11*F16/36000)+SUM($M$2:$M15),0)","v":0},null,null,"2020-12-10","2023-09-07",null,{"$f":"\"MR26\"&Información!$H$3","v":"MR26JN22"}]
[null,null,null,"","2021-06-10","",182,5.0555555555555554,0,0,"","",{"$f":"IFERROR(H17/(1+$B$11*F17/36000)+SUM($M$2:$M16),0)","v":0},null,null,"2021-06-10","2024-03-07",null,{"$f":"\"MR26\"&Información!$H$4","v":"MR26SP22"}]
[null,null,null,"","2021-12-09","",182,5.0555555555555554,0,0,"","",{"$f":"IFERROR(H18/(1+$B$11*F18/36000)+SUM($M$2:$M17),0)","v":0},null,null,"2021-12-09","2024-09-05",null,{"$f":"\"MR26\"&Información!$H$5","v":"MR26DC22"}]
[null,null,null,"VIG","2022-06-09",156,182,5.0555555555555554,0,4.9037520434394954,4.9315256375443344,1,{"$f":"IFERROR(H19/(1+$B$11*F19/36000)+SUM($M$2:$M18),0)","v":4.9315256375443344},null,null,"2022-06-09","2025-03-06"]
[null,null,null,"","2022-12-08",338,182,5.0555555555555554,0,4.732399351294668,4.7943017484412067,2,{"$f":"IFERROR(H20/(1+$B$11*F20/36000)+SUM($M$2:$M19),0)","v":9.7258273859855411},null,null,"2022-12-08","2025-09-04",null,{"$f":"\"MY31\"&Información!$H$2","v":"MY31MR22"}]
{"$rows_left_out":51}
{"sheet":"CALCF","index":1,"n_rows":70,"n_cols":17,"rows_kept":70,"cut":false,"hidden":true,"merged":[]}
["Fecha Valuación",{"$f":"+CALC!B5","v":"2022-03-31"},null,null,"Fecha Fin","Dxv","Plazo Cupon",null,null,null,null,null,null,null,null,"Fecha Fin Fung","Fecha Fin No Fung"]
["Vencimiento",{"$f":"+CALC!B4","v":"2024-12-05"},null,null,{"$f":"IF(CALC!$B$1=\"MR26\",Q2,P2)","v":"2013-12-19"},{"$f":"IF(OR(E2-$B$1<=0,E2>$B$2),\"\",E2-$B$1)","v":""},null,null,null,null,null,null,null,null,null,"2013-12-19","2016-09-15"]
["Tasa Cupón",{"$f":"+CALC!B6","v":10},null,{"$f":"IF(F3=MIN($F:$F),\"VIG\",\"\")","v":""},{"$f":"IF(CALC!$B$1=\"MR26\",Q3,P3)","v":"2014-06-19"},"",{"$f":"IF(E3-E2<0,0,E3-E2)","v":182},null,null,null,null,null,null,null,null,"2014-06-19","2017-03-16"]
["Tasa Yield",7.3282505277249337,null,"",{"$f":"IF(CALC!$B$1=\"MR26\",Q4,P4)","v":"2014-12-18"},"",{"$f":"IF(E4-E3<0,0,E4-E3)","v":182},{"$f":"IF(F4<=0,0,IF(F4=MAX($F:$F),$B$3/36000*G4*100+100,$B$3/36000*G4*100))","v":5.0555555555555554},{"$f":"IF(F4=\"\",0,H4/(1+$B$4*182/36000)^(F4/182))","v":0},null,null,null,null,null,null,"2014-12-18","2017-09-14"]
["Precio Sucio",{"$f":"SUM(I:I)","v":109.57497598398065},null,"",{"$f":"IF(CALC!$B$1=\"MR26\",Q5,P5)","v":"2015-06-18"},"",182,{"$f":"IF(F5<=0,0,IF(F5=MAX($F:$F),$B$3/36000*G5*100+100,$B$3/36000*G5*100))","v":5.0555555555555554},{"$f":"IF(F5=\"\",0,H5/(1+$B$4*182/36000)^(F5/182))","v":0},null,null,null,null,null,null,"2015-06-18","2018-03-15"]
[null,{"$f":"+B5-CALC!B15","v":-8.7597161521145495E-2},null,"",{"$f":"IF(CALC!$B$1=\"MR26\",Q6,P6)","v":"2015-12-17"},"",182,{"$f":"IF(F6<=0,0,IF(F6=MAX($F:$F),$B$3/36000*G6*100+100,$B$3/36000*G6*100))","v":5.0555555555555554},0,null,null,null,null,null,null,"2015-12-17","2018-09-13"]
[null,null,null,"",{"$f":"IF(CALC!$B$1=\"MR26\",Q7,P7)","v":"2016-06-16"},"",182,5.0555555555555554,0,null,null,null,null,null,null,"2016-06-16","2019-03-14"]
[null,null,null,"",{"$f":"IF(CALC!$B$1=\"MR26\",Q8,P8)","v":"2016-12-15"},"",182,5.0555555555555554,0,null,null,null,null,null,null,"2016-12-15","2019-09-12"]
[null,null,null,"",{"$f":"IF(CALC!$B$1=\"MR26\",Q9,P9)","v":"2017-06-15"},"",182,5.0555555555555554,0,null,null,null,null,null,null,"2017-06-15","2020-03-12"]
[null,null,null,"",{"$f":"IF(CALC!$B$1=\"MR26\",Q10,P10)","v":"2017-12-14"},"",182,5.0555555555555554,0,null,null,null,null,null,null,"2017-12-14","2020-09-10"]
[null,null,null,"",{"$f":"IF(CALC!$B$1=\"MR26\",Q11,P11)","v":"2018-06-14"},"",182,5.0555555555555554,0,null,null,null,null,null,null,"2018-06-14","2021-03-11"]
[null,null,null,"",{"$f":"IF(CALC!$B$1=\"MR26\",Q12,P12)","v":"2018-12-13"},"",182,5.0555555555555554,0,null,null,null,null,null,null,"2018-12-13","2021-09-09"]
[null,null,null,"",{"$f":"IF(CALC!$B$1=\"MR26\",Q13,P13)","v":"2019-06-13"},"",182,5.0555555555555554,0,null,null,null,null,null,null,"2019-06-13","2022-03-10"]
[null,null,null,"",{"$f":"IF(CALC!$B$1=\"MR26\",Q14,P14)","v":"2019-12-11"},"",181,5.0277777777777777,0,null,null,null,null,null,null,"2019-12-11","2022-09-08"]
[null,null,null,"",{"$f":"IF(CALC!$B$1=\"MR26\",Q15,P15)","v":"2020-06-11"},"",183,5.083333333333333,0,null,null,null,null,null,null,"2020-06-11","2023-03-09"]
[null,null,null,"",{"$f":"IF(CALC!$B$1=\"MR26\",Q16,P16)","v":"2020-12-10"},"",182,5.0555555555555554,0,null,null,null,null,null,null,"2020-12-10","2023-09-07"]
[null,null,null,"",{"$f":"IF(CALC!$B$1=\"MR26\",Q17,P17)","v":"2021-06-10"},"",182,5.0555555555555554,0,null,null,null,null,null,null,"2021-06-10","2024-03-07"]
[null,null,null,"",{"$f":"IF(CALC!$B$1=\"MR26\",Q18,P18)","v":"2021-12-09"},"",182,5.0555555555555554,0,null,null,null,null,null,null,"2021-12-09","2024-09-05"]
[null,null,null,"VIG",{"$f":"IF(CALC!$B$1=\"MR26\",Q19,P19)","v":"2022-06-09"},70,182,5.0555555555555554,4.9853119898876264,null,null,null,null,null,null,"2022-06-09","2025-03-06"]
[null,null,null,"",{"$f":"IF(CALC!$B$1=\"MR26\",Q20,P20)","v":"2022-12-08"},252,182,5.0555555555555554,4.8072125633119667,null,null,null,null,null,null,"2022-12-08","2025-09-04"]
{"$rows_left_out":51}
{"sheet":"Información","index":2,"n_rows":2000,"n_cols":9,"rows_kept":2000,"cut":false,"hidden":false,"merged":[]}
[1,5.48,null,null,"Contrato","Vencimiento","Cupón","Contrato","Vencimiento"]
[2,5.48,null,null,"DC24","2024-12-05",10,"MR22","2022-03-31"]
[3,5.48,null,null,"MR26","2026-03-05",5.75,"JN22","2022-06-30"]
[4,5.48,null,null,"JN27","2027-06-03",7.5,"SP22","2022-09-30"]
[5,5.48,null,null,"MY29","2029-05-31",8.5,"DC22","2022-12-30"]
[6,5.48,null,null,"MY31","2031-05-29",7.75]
[7,5.48,null,null,"NV36","2036-11-20",10]
[8,5.48,null,null,"NV42","2042-11-13",7.75]
[9,5.48,null,null,"NV47","2047-11-07",8]
[10,5.48]
[11,5.48]
[12,5.48]
[13,5.48]
[14,5.48]
[15,5.4798419999999997]
[16,5.4785750000000002]
[17,5.4755599999999998]
[18,5.471495]
[19,5.4670810000000003]
[20,5.4630150000000004]
{"$rows_left_out":1981}
{"sheet":"FUTUROS ESPECIFICOS","index":3,"n_rows":140,"n_cols":22,"rows_kept":140,"cut":false,"hidden":false,"merged":[[1,16,1,17],[3,16,3,17]]}
["Contrato","YCash Bid","YFut Bid","Bid","Ask","Y F Ask","YCash Ask","Last","Tasa Fut","Tasa Cash",null,"BID","ASK","Last","PPP",null,null,null,null,"Plazos","DXV","Fondeo"]
[{"$f":"Información!E2&Información!$H$2","v":"DC24MR22"},null,null,null,null,null,null,null,null,null,null,{"$f":"IF(RTD(\"gllinks.rtd\",,\"Mkt\",$A2,L$1)=\"--\",\"\",RTD(\"gllinks.rtd\",,\"Mkt\",$A2,L$1))","v":{"$error":"#N/A"}},{"$f":"IF(RTD(\"gllinks.rtd\",,\"Mkt\",$A2,M$1)=\"--\",\"\",RTD(\"gllinks.rtd\",,\"Mkt\",$A2,M$1))","v":{"$error":"#N/A"}},{"$f":"IF(RTD(\"gllinks.rtd\",,\"Mkt\",$A2,N$1)=\"--\",\"\",RTD(\"gllinks.rtd\",,\"Mkt\",$A2,N$1))","v":{"$error":"#N/A"}},{"$f":"IFERROR((_xll.rtdValue(\"BID QTY\",$A2,\"EMD\",\"MXN\")*M2+_xll.rtdValue(\"ASK QTY\",$A2,\"EMD\",\"MXN\")*L2)/(_xll.rtdValue(\"BID QTY\",$A2,\"EMD\",\"MXN\")+_xll.rtdValue(\"ASK QTY\",$A2,\"EMD\",\"MXN\")),\"\")","v":""},null,"Fecha Valuación",null,null,{"$f":"+Información!H2","v":"MR22"},{"$f":"VLOOKUP(T2,CTOS_FUT,2,0)-'FUTUROS ESPECIFICOS'!$Q$4","v":86},{"$f":"VLOOKUP(U2,Información!$A:$B,2,0)","v":5.8039420000000002}]
[null,null,null,null,null,null,null,null,null,null,null,{"$f":"IF(RTD(\"gllinks.rtd\",,\"Mkt\",$A3,L$1)=\"--\",\"\",RTD(\"gllinks.rtd\",,\"Mkt\",$A3,L$1))","v":{"$error":"#N/A"}},{"$f":"IF(RTD(\"gllinks.rtd\",,\"Mkt\",$A3,M$1)=\"--\",\"\",RTD(\"gllinks.rtd\",,\"Mkt\",$A3,M$1))","v":{"$error":"#N/A"}},{"$f":"IF(RTD(\"gllinks.rtd\",,\"Mkt\",$A3,N$1)=\"--\",\"\",RTD(\"gllinks.rtd\",,\"Mkt\",$A3,N$1))","v":{"$error":"#N/A"}},null,null,null,null,null,null,null,{"$f":"VLOOKUP(U3,Información!$A:$B,2,0)","v":{"$error":"#N/A"}}]
[{"$f":"Información!E2&Información!$H$3","v":"DC24JN22"},null,null,null,null,null,null,null,null,null,null,{"$f":"IF(RTD(\"gllinks.rtd\",,\"Mkt\",$A4,L$1)=\"--\",\"\",RTD(\"gllinks.rtd\",,\"Mkt\",$A4,L$1))","v":{"$error":"#N/A"}},{"$f":"IF(RTD(\"gllinks.rtd\",,\"Mkt\",$A4,M$1)=\"--\",\"\",RTD(\"gllinks.rtd\",,\"Mkt\",$A4,M$1))","v":{"$error":"#N/A"}},{"$f":"IF(RTD(\"gllinks.rtd\",,\"Mkt\",$A4,N$1)=\"--\",\"\",RTD(\"gllinks.rtd\",,\"Mkt\",$A4,N$1))","v":{"$error":"#N/A"}},{"$f":"IFERROR((_xll.rtdValue(\"BID QTY\",$A4,\"EMD\",\"MXN\")*M4+_xll.rtdValue(\"ASK QTY\",$A4,\"EMD\",\"MXN\")*L4)/(_xll.rtdValue(\"BID QTY\",$A4,\"EMD\",\"MXN\")+_xll.rtdValue(\"ASK QTY\",$A4,\"EMD\",\"MXN\")),\"\")","v":""},null,{"$f":"WORKDAY(TODAY(),2,calendario!$A$1:$A$339)","v":"2022-01-04"},null,null,{"$f":"+Información!H3","v":"JN22"},{"$f":"VLOOKUP(T4,CTOS_FUT,2,0)-'FUTUROS ESPECIFICOS'!$Q$4","v":177},{"$f":"VLOOKUP(U4,Información!$A:$B,2,0)","v":6.2723620000000002}]
[null,null,null,null,null,null,null,null,null,null,null,{"$f":"IF(RTD(\"gllinks.rtd\",,\"Mkt\",$A5,L$1)=\"--\",\"\",RTD(\"gllinks.rtd\",,\"Mkt\",$A5,L$1))","v":{"$error":"#N/A"}},{"$f":"IF(RTD(\"gllinks.rtd\",,\"Mkt\",$A5,M$1)=\"--\",\"\",RTD(\"gllinks.rtd\",,\"Mkt\",$A5,M$1))","v":{"$error":"#N/A"}},{"$f":"IF(RTD(\"gllinks.rtd\",,\"Mkt\",$A5,N$1)=\"--\",\"\",RTD(\"gllinks.rtd\",,\"Mkt\",$A5,N$1))","v":{"$error":"#N/A"}},null,null,null,null,null,null,null,{"$f":"VLOOKUP(U5,Información!$A:$B,2,0)","v":{"$error":"#N/A"}}]
[{"$f":"Información!E2&Información!$H$4","v":"DC24SP22"},null,null,null,null,null,null,null,null,null,null,{"$f":"IF(RTD(\"gllinks.rtd\",,\"Mkt\",$A6,L$1)=\"--\",\"\",RTD(\"gllinks.rtd\",,\"Mkt\",$A6,L$1))","v":{"$error":"#N/A"}},{"$f":"IF(RTD(\"gllinks.rtd\",,\"Mkt\",$A6,M$1)=\"--\",\"\",RTD(\"gllinks.rtd\",,\"Mkt\",$A6,M$1))","v":{"$error":"#N/A"}},{"$f":"IF(RTD(\"gllinks.rtd\",,\"Mkt\",$A6,N$1)=\"--\",\"\",RTD(\"gllinks.rtd\",,\"Mkt\",$A6,N$1))","v":{"$error":"#N/A"}},{"$f":"IFERROR((_xll.rtdValue(\"BID QTY\",$A6,\"EMD\",\"MXN\")*M6+_xll.rtdValue(\"ASK QTY\",$A6,\"EMD\",\"MXN\")*L6)/(_xll.rtdValue(\"BID QTY\",$A6,\"EMD\",\"MXN\")+_xll.rtdValue(\"ASK QTY\",$A6,\"EMD\",\"MXN\")),\"\")","v":""},null,null,null,null,{"$f":"+Información!H4","v":"SP22"},{"$f":"VLOOKUP(T6,CTOS_FUT,2,0)-'FUTUROS ESPECIFICOS'!$Q$4","v":269},{"$f":"VLOOKUP(U6,Información!$A:$B,2,0)","v":6.748685}]
[null,null,null,null,null,null,null,null,null,null,null,{"$f":"IF(RTD(\"gllinks.rtd\",,\"Mkt\",$A7,L$1)=\"--\",\"\",RTD(\"gllinks.rtd\",,\"Mkt\",$A7,L$1))","v":{"$error":"#N/A"}},{"$f":"IF(RTD(\"gllinks.rtd\",,\"Mkt\",$A7,M$1)=\"--\",\"\",RTD(\"gllinks.rtd\",,\"Mkt\",$A7,M$1))","v":{"$error":"#N/A"}},{"$f":"IF(RTD(\"gllinks.rtd\",,\"Mkt\",$A7,N$1)=\"--\",\"\",RTD(\"gllinks.rtd\",,\"Mkt\",$A7,N$1))","v":{"$error":"#N/A"}},null,null,null,null,null,null,null,3.59151833]
[{"$f":"Información!E2&Información!$H$5","v":"DC24DC22"},null,null,null,null,null,null,null,null,null,null,{"$f":"IF(RTD(\"gllinks.rtd\",,\"Mkt\",$A8,L$1)=\"--\",\"\",RTD(\"gllinks.rtd\",,\"Mkt\",$A8,L$1))","v":{"$error":"#N/A"}},{"$f":"IF(RTD(\"gllinks.rtd\",,\"Mkt\",$A8,M$1)=\"--\",\"\",RTD(\"gllinks.rtd\",,\"Mkt\",$A8,M$1))","v":{"$error":"#N/A"}},{"$f":"IF(RTD(\"gllinks.rtd\",,\"Mkt\",$A8,N$1)=\"--\",\"\",RTD(\"gllinks.rtd\",,\"Mkt\",$A8,N$1))","v":{"$error":"#N/A"}},{"$f":"IFERROR((_xll.rtdValue(\"BID QTY\",$A8,\"EMD\",\"MXN\")*M8+_xll.rtdValue(\"ASK QTY\",$A8,\"EMD\",\"MXN\")*L8)/(_xll.rtdValue(\"BID QTY\",$A8,\"EMD\",\"MXN\")+_xll.rtdValue(\"ASK QTY\",$A8,\"EMD\",\"MXN\")),\"\")","v":""},null,null,null,null,{"$f":"+Información!H5","v":"DC22"},{"$f":"VLOOKUP(T8,CTOS_FUT,2,0)-'FUTUROS ESPECIFICOS'!$Q$4","v":360},{"$f":"VLOOKUP(U8,Información!$A:$B,2,0)","v":6.94}]
[null,null,null,null,null,null,null,null,null,null,null,{"$f":"IF(RTD(\"gllinks.rtd\",,\"Mkt\",$A9,L$1)=\"--\",\"\",RTD(\"gllinks.rtd\",,\"Mkt\",$A9,L$1))","v":{"$error":"#N/A"}},{"$f":"IF(RTD(\"gllinks.rtd\",,\"Mkt\",$A9,M$1)=\"--\",\"\",RTD(\"gllinks.rtd\",,\"Mkt\",$A9,M$1))","v":{"$error":"#N/A"}},{"$f":"IF(RTD(\"gllinks.rtd\",,\"Mkt\",$A9,N$1)=\"--\",\"\",RTD(\"gllinks.rtd\",,\"Mkt\",$A9,N$1))","v":{"$error":"#N/A"}},null,null,null,null,null,null,null,3.6003676699999998]
[null,null,null,null,null,null,null,null,null,null,null,{"$f":"IF(RTD(\"gllinks.rtd\",,\"Mkt\",$A10,L$1)=\"--\",\"\",RTD(\"gllinks.rtd\",,\"Mkt\",$A10,L$1))","v":{"$error":"#N/A"}},{"$f":"IF(RTD(\"gllinks.rtd\",,\"Mkt\",$A10,M$1)=\"--\",\"\",RTD(\"gllinks.rtd\",,\"Mkt\",$A10,M$1))","v":{"$error":"#N/A"}},{"$f":"IF(RTD(\"gllinks.rtd\",,\"Mkt\",$A10,N$1)=\"--\",\"\",RTD(\"gllinks.rtd\",,\"Mkt\",$A10,N$1))","v":{"$error":"#N/A"}}]
[]
[{"$f":"Información!E3&Información!$H$2","v":"MR26MR22"},null,null,null,null,null,null,null,null,null,null,{"$f":"IF(RTD(\"gllinks.rtd\",,\"Mkt\",$A12,L$1)=\"--\",\"\",RTD(\"gllinks.rtd\",,\"Mkt\",$A12,L$1))","v":{"$error":"#N/A"}},{"$f":"IF(RTD(\"gllinks.rtd\",,\"Mkt\",$A12,M$1)=\"--\",\"\",RTD(\"gllinks.rtd\",,\"Mkt\",$A12,M$1))","v":{"$error":"#N/A"}},{"$f":"IF(RTD(\"gllinks.rtd\",,\"Mkt\",$A12,N$1)=\"--\",\"\",RTD(\"gllinks.rtd\",,\"Mkt\",$A12,N$1))","v":{"$error":"#N/A"}},{"$f":"IFERROR((_xll.rtdValue(\"BID QTY\",$A12,\"EMD\",\"MXN\")*M12+_xll.rtdValue(\"ASK QTY\",$A12,\"EMD\",\"MXN\")*L12)/(_xll.rtdValue(\"BID QTY\",$A12,\"EMD\",\"MXN\")+_xll.rtdValue(\"ASK QTY\",$A12,\"EMD\",\"MXN\")),\"\")","v":""}]
[null,null,null,null,null,null,null,null,null,null,null,{"$f":"IF(RTD(\"gllinks.rtd\",,\"Mkt\",$A13,L$1)=\"--\",\"\",RTD(\"gllinks.rtd\",,\"Mkt\",$A13,L$1))","v":{"$error":"#N/A"}},{"$f":"IF(RTD(\"gllinks.rtd\",,\"Mkt\",$A13,M$1)=\"--\",\"\",RTD(\"gllinks.rtd\",,\"Mkt\",$A13,M$1))","v":{"$error":"#N/A"}},{"$f":"IF(RTD(\"gllinks.rtd\",,\"Mkt\",$A13,N$1)=\"--\",\"\",RTD(\"gllinks.rtd\",,\"Mkt\",$A13,N$1))","v":{"$error":"#N/A"}}]
[{"$f":"Información!E3&Información!$H$3","v":"MR26JN22"},null,null,null,null,null,null,null,null,null,null,{"$f":"IF(RTD(\"gllinks.rtd\",,\"Mkt\",$A14,L$1)=\"--\",\"\",RTD(\"gllinks.rtd\",,\"Mkt\",$A14,L$1))","v":{"$error":"#N/A"}},{"$f":"IF(RTD(\"gllinks.rtd\",,\"Mkt\",$A14,M$1)=\"--\",\"\",RTD(\"gllinks.rtd\",,\"Mkt\",$A14,M$1))","v":{"$error":"#N/A"}},{"$f":"IF(RTD(\"gllinks.rtd\",,\"Mkt\",$A14,N$1)=\"--\",\"\",RTD(\"gllinks.rtd\",,\"Mkt\",$A14,N$1))","v":{"$error":"#N/A"}},{"$f":"IFERROR((_xll.rtdValue(\"BID QTY\",$A14,\"EMD\",\"MXN\")*M14+_xll.rtdValue(\"ASK QTY\",$A14,\"EMD\",\"MXN\")*L14)/(_xll.rtdValue(\"BID QTY\",$A14,\"EMD\",\"MXN\")+_xll.rtdValue(\"ASK QTY\",$A14,\"EMD\",\"MXN\")),\"\")","v":""}]
[null,null,null,null,null,null,null,null,null,null,null,{"$f":"IF(RTD(\"gllinks.rtd\",,\"Mkt\",$A15,L$1)=\"--\",\"\",RTD(\"gllinks.rtd\",,\"Mkt\",$A15,L$1))","v":{"$error":"#N/A"}},{"$f":"IF(RTD(\"gllinks.rtd\",,\"Mkt\",$A15,M$1)=\"--\",\"\",RTD(\"gllinks.rtd\",,\"Mkt\",$A15,M$1))","v":{"$error":"#N/A"}},{"$f":"IF(RTD(\"gllinks.rtd\",,\"Mkt\",$A15,N$1)=\"--\",\"\",RTD(\"gllinks.rtd\",,\"Mkt\",$A15,N$1))","v":{"$error":"#N/A"}}]
[{"$f":"Información!E3&Información!$H$4","v":"MR26SP22"},null,null,null,null,null,null,null,null,null,null,{"$f":"IF(RTD(\"gllinks.rtd\",,\"Mkt\",$A16,L$1)=\"--\",\"\",RTD(\"gllinks.rtd\",,\"Mkt\",$A16,L$1))","v":{"$error":"#N/A"}},{"$f":"IF(RTD(\"gllinks.rtd\",,\"Mkt\",$A16,M$1)=\"--\",\"\",RTD(\"gllinks.rtd\",,\"Mkt\",$A16,M$1))","v":{"$error":"#N/A"}},{"$f":"IF(RTD(\"gllinks.rtd\",,\"Mkt\",$A16,N$1)=\"--\",\"\",RTD(\"gllinks.rtd\",,\"Mkt\",$A16,N$1))","v":{"$error":"#N/A"}},{"$f":"IFERROR((_xll.rtdValue(\"BID QTY\",$A16,\"EMD\",\"MXN\")*M16+_xll.rtdValue(\"ASK QTY\",$A16,\"EMD\",\"MXN\")*L16)/(_xll.rtdValue(\"BID QTY\",$A16,\"EMD\",\"MXN\")+_xll.rtdValue(\"ASK QTY\",$A16,\"EMD\",\"MXN\")),\"\")","v":""}]
[null,null,null,null,null,null,null,null,null,null,null,{"$f":"IF(RTD(\"gllinks.rtd\",,\"Mkt\",$A17,L$1)=\"--\",\"\",RTD(\"gllinks.rtd\",,\"Mkt\",$A17,L$1))","v":{"$error":"#N/A"}},{"$f":"IF(RTD(\"gllinks.rtd\",,\"Mkt\",$A17,M$1)=\"--\",\"\",RTD(\"gllinks.rtd\",,\"Mkt\",$A17,M$1))","v":{"$error":"#N/A"}},{"$f":"IF(RTD(\"gllinks.rtd\",,\"Mkt\",$A17,N$1)=\"--\",\"\",RTD(\"gllinks.rtd\",,\"Mkt\",$A17,N$1))","v":{"$error":"#N/A"}}]
[{"$f":"Información!E3&Información!$H$5","v":"MR26DC22"},null,null,null,null,null,null,null,null,null,null,{"$f":"IF(RTD(\"gllinks.rtd\",,\"Mkt\",$A18,L$1)=\"--\",\"\",RTD(\"gllinks.rtd\",,\"Mkt\",$A18,L$1))","v":{"$error":"#N/A"}},{"$f":"IF(RTD(\"gllinks.rtd\",,\"Mkt\",$A18,M$1)=\"--\",\"\",RTD(\"gllinks.rtd\",,\"Mkt\",$A18,M$1))","v":{"$error":"#N/A"}},{"$f":"IF(RTD(\"gllinks.rtd\",,\"Mkt\",$A18,N$1)=\"--\",\"\",RTD(\"gllinks.rtd\",,\"Mkt\",$A18,N$1))","v":{"$error":"#N/A"}},{"$f":"IFERROR((_xll.rtdValue(\"BID QTY\",$A18,\"EMD\",\"MXN\")*M18+_xll.rtdValue(\"ASK QTY\",$A18,\"EMD\",\"MXN\")*L18)/(_xll.rtdValue(\"BID QTY\",$A18,\"EMD\",\"MXN\")+_xll.rtdValue(\"ASK QTY\",$A18,\"EMD\",\"MXN\")),\"\")","v":""}]
[]
[]
{"$rows_left_out":121}
{"sheet":"calendario","index":4,"n_rows":339,"n_cols":1,"rows_kept":339,"cut":false,"hidden":true,"merged":[]}
["2015-01-01"]
["2015-02-02"]
["2015-03-16"]
["2015-04-02"]
["2015-04-03"]
["2015-05-01"]
["2015-09-16"]
["2015-11-02"]
["2015-11-16"]
["2015-12-25"]
["2016-01-01"]
["2016-02-01"]
["2016-03-21"]
["2016-03-24"]
["2016-03-25"]
["2016-09-16"]
["2016-11-02"]
["2016-11-21"]
["2016-12-12"]
["2017-02-06"]
{"$rows_left_out":320}
{"sheet":"Entrega Anticipada","index":5,"n_rows":17,"n_cols":3,"rows_kept":17,"cut":false,"hidden":true,"merged":[]}
[]
[]
[]
[]
[null,"Fecha entrega",{"$f":"CALC!B3","v":"2022-01-04"}]
[null,"Precio Liquidación ",116.2]
[null,"Dias x vencer",1]
[null,"VP Cupón vig",{"$f":"CALC!B13","v":0}]
[null,"Tasa Fondeo",{"$f":"CALC!B11","v":5.8039420000000002}]
[]
[null,"Si se entrega el bono antes de que corte cupón"]
[]
[null,"Precio Entrega",{"$f":"C6/(1+C9*C7/36000)+C8","v":116.18126918478238}]
[]
[null,"Si se entrega el bono en el corte de cupón o despué"]
[]
[null,"Precio Entrega",{"$f":"C6/(1+C9*C7/36000)","v":116.18126918478238}]