{"text_format":"1","workbook":"xlsx","n_sheets":5,"sheets":["CALC","CALCF","Información","FUTUROS ESPECIFICOS","calendario"],"not_rendered":{"charts":0,"images":3,"macros":1,"external_links":0,"defined_names":60,"comments":0,"pivot_tables":0},"unopened":[],"bounds":{"document_bytes":16777216,"sheet_cells":100000,"rows_first":2000,"rows_last":500,"rows_between":2000,"halvings":0,"cell_chars":16384,"cell_head_chars":4096},"cells_cut":0,"cells_raw":0,"read":"whole","date_system":"1900"}

{"sheet":"CALC","index":0,"n_rows":60,"n_cols":13,"rows_kept":60,"cut":false,"hidden":true,"merged":[]}
["Emision","NV42",null,null,"Fecha Fin","Dxv","Plazo Cupon","Flujo Cupón","Amort","VP"]
["Contrato","SP16",null,null,"2013-12-19",{"$f":"IF(OR(E2-$B$3<=0,E2>$B$4),\"\",E2-$B$3)","v":""}]
["Fecha Valuación",{"$f":"DIA_VALUACION","v":"2016-06-29"},null,{"$f":"IF(F3=MIN($F:$F),\"VIG\",\"\")","v":""},"2014-06-19","",{"$f":"+E3-E2","v":182},{"$f":"IF(F3<=0,0,$B$6/36000*G3*100)","v":3.9180555555555552},{"$f":"IF(F3=MAX($F:$F),100,0)","v":0},{"$f":"IF(F3=\"\",0,(H3+I3)/(1+$B$7*182/36000)^(F3/182))","v":0},null,{"$f":"IF(F3=\"\",\"\",IF(F3=MIN($F:$F),1,L2+1))","v":""},{"$f":"IFERROR(H3/(1+$B$11*F3/36000)+SUM($M$2:$M2),0)","v":0}]
["Vencimiento",{"$f":"VLOOKUP($B$1,CTOS_CASH,2,0)","v":"2042-11-13"},null,{"$f":"IF(F4=MIN($F:$F),\"VIG\",\"\")","v":""},"2014-12-18","",{"$f":"+E4-E3","v":182},3.9180555555555552,{"$f":"IF(F4=MAX($F:$F),100,0)","v":0},0,{"$f":"IFERROR(H4/(1+$B$11*F4/36000),\"\")","v":""},"",{"$f":"IFERROR(H4/(1+$B$11*F4/36000)+SUM($M$2:$M3),0)","v":0}]
["Venc. Futuro",{"$f":"VLOOKUP($B$2,CTOS_FUT,2,0)","v":"2016-09-30"},null,"","2015-06-18","",182,3.9180555555555552,0,0,"","",{"$f":"IFERROR(H5/(1+$B$11*F5/36000)+SUM($M$2:$M4),0)","v":0}]
["Tasa Cupón",{"$f":"VLOOKUP($B$1,CTOS_CASH,3,0)","v":7.75},null,"","2015-12-17","",182,3.9180555555555552,0,0,{"$f":"IFERROR(H6/(1+$B$11*F6/36000),\"\")","v":""},"",{"$f":"IFERROR(H6/(1+$B$11*F6/36000)+SUM($M$2:$M5),0)","v":0}]
["Tasa Yield",6.7615995010375487,null,"","2016-06-16","",182,3.9180555555555552,0,0,"","",{"$f":"IFERROR(H7/(1+$B$11*F7/36000)+SUM($M$2:$M6),0)","v":0}]
["Precio Sucio",{"$f":"SUM($J:$J)","v":112.42591214095329},null,"VIG","2016-12-15",169,182,3.9180555555555552,0,3.7976559395812242,3.841421957108186,1,{"$f":"IFERROR(H8/(1+$B$11*F8/36000)+SUM($M$2:$M7),0)","v":3.841421957108186}]
["Precio Limpio",{"$f":"+B8-B10","v":112.14605102984217},null,"","2017-06-15",351,182,3.9180555555555552,0,3.6721291902506934,3.7621768388068895,2,{"$f":"IFERROR(H9/(1+$B$11*F9/36000)+SUM($M$2:$M8),0)","v":7.6035987959150759}]
["Intereses",{"$f":"100*$B$6/36000*(VLOOKUP(\"VIG\",$D:$G,4,0)-VLOOKUP(\"VIG\",$D:$G,3,0))","v":0.27986111111111112},null,"","2017-12-14",533,182,3.9180555555555552,0,3.5507515700272156,3.6861351492353478,3,{"$f":"IFERROR(H10/(1+$B$11*F10/36000)+SUM($M$2:$M9),0)","v":15.131155902258609}]
["Fondeo",{"$f":"VLOOKUP($B$2,TABLA_FONDEO,3,0)","v":4.2495505600000003},null,"","2018-06-14",715,182,3.9180555555555552,0,3.4333859346571654,3.6131064921475713,4,{"$f":"IFERROR(H11/(1+$B$11*F11/36000)+SUM($M$2:$M10),0)","v":30.189283147429443}]
["Cupones",{"$f":"VLOOKUP($B$2,CTOS_FUT,3,0)","v":0},null,"","2018-12-13",897,182,3.9180555555555552,0,3.3198996730180435,3.5429152664838113,5,{"$f":"IFERROR(H12/(1+$B$11*F12/36000)+SUM($M$2:$M11),0)","v":60.308375069195122}]
["VP Cupón",{"$f":"IFERROR(VLOOKUP($B$12,$L:$M,2,0),0)","v":0},null,"","2019-06-13",1079,182,3.9180555555555552,0,3.2101645572815185,3.4753992566389384,6,{"$f":"IFERROR(H13/(1+$B$11*F13/36000)+SUM($M$2:$M12),0)","v":120.54923412854536}]
["DXV FUT",{"$f":"+B5-B3","v":93},null,"","2019-12-11",1260,181,3.896527777777778,0,3.0875715122927754,3.392018398767354,7,{"$f":"IFERROR(H14/(1+$B$11*F14/36000)+SUM($M$2:$M13),0)","v":241.01508739921914}]
["Acarreo",{"$f":"(B8-B13)*(1+B11*B14/36000)","v":113.66012443552079},null,"","2020-06-11",1443,183,3.9395833333333332,0,3.0179474201139356,3.3661981029147343,8,{"$f":"IFERROR(H15/(1+$B$11*F15/36000)+SUM($M$2:$M14),0)","v":482.00435450258567}]
["Tasa Yield",{"$f":"CALCF!B4","v":6.8196425640906924},null,"","2020-12-10",1625,182,3.9180555555555552,0,2.9022465474112176,3.2874558126258573,9,{"$f":"IFERROR(H16/(1+$B$11*F16/36000)+SUM($M$2:$M15),0)","v":963.92996671488243}]
[null,null,null,"","2021-06-10",1807,182,3.9180555555555552,0,2.8063164314006399,3.2292451901164392,10,{"$f":"IFERROR(H17/(1+$B$11*F17/36000)+SUM($M$2:$M16),0)","v":1927.8017228072556}]
[null,null,null,"","2021-12-09",1989,182,3.9180555555555552,0,2.7135571649397021,3.1730601590033118,11,{"$f":"IFERROR(H18/(1+$B$11*F18/36000)+SUM($M$2:$M17),0)","v":3855.5472605833984}]
[null,null,null,"","2022-06-09",2171,182,3.9180555555555552,0,2.6238639395773711,3.11879679872695,12,{"$f":"IFERROR(H19/(1+$B$11*F19/36000)+SUM($M$2:$M18),0)","v":7711.0402578065205}]
[null,null,null,"","2022-12-08",2353,182,3.9180555555555552,0,2.5371354111743827,3.0663581778985507,13,{"$f":"IFERROR(H20/(1+$B$11*F20/36000)+SUM($M$2:$M19),0)","v":15422.028076992212}]
[null,null,null,"","2023-06-08",2535,182,3.9180555555555552,0,2.4532735853947627,3.015653776445621,14,{"$f":"IFERROR(H21/(1+$B$11*F21/36000)+SUM($M$2:$M20),0)","v":30844.005449582972}]
[null,null,null,"","2023-12-07",2717,182,3.9180555555555552,0,2.3721837069822862,2.9665989641563679,15,{"$f":"IFERROR(H22/(1+$B$11*F22/36000)+SUM($M$2:$M21),0)","v":61687.961844353653}]
[null,null,null,"","2024-06-06",2899,182,3.9180555555555552,0,2.2937741526967623,2.9191145293037031,16,{"$f":"IFERROR(H23/(1+$B$11*F23/36000)+SUM($M$2:$M22),0)","v":123375.87620427244}]
[null,null,null,"","2024-12-05",3081,182,3.9180555555555552,0,2.2179563277891785,2.8731262518261249,17,{"$f":"IFERROR(H24/(1+$B$11*F24/36000)+SUM($M$2:$M23),0)","v":246751.70642026741}]
[null,null,null,"","2025-06-05",3263,182,3.9180555555555552,0,2.1446445658987217,2.8285645162279835,18,{"$f":"IFERROR(H25/(1+$B$11*F25/36000)+SUM($M$2:$M24),0)","v":493503.36827879917}]
[null,null,null,"","2025-12-04",3445,182,3.9180555555555552,0,2.0737560322585886,2.7853639599527016,19,{"$f":"IFERROR(H26/(1+$B$11*F26/36000)+SUM($M$2:$M25),0)","v":987006.69335704215}]
[null,null,null,"","2026-06-04",3627,182,3.9180555555555552,0,2.0052106301011978,2.7434631534935612,20,{"$f":"IFERROR(H27/(1+$B$11*F27/36000)+SUM($M$2:$M26),0)","v":1974013.3448132779}]
[null,null,null,"","2026-12-03",3809,182,3.9180555555555552,0,1.9389309101570611,2.7028043089495442,21,{"$f":"IFERROR(H28/(1+$B$11*F28/36000)+SUM($M$2:$M27),0)","v":3948026.6489677113}]
[null,null,null,"","2027-06-03",3991,182,3.9180555555555552,0,1.8748419831450629,2.6633330141183769,22,{"$f":"IFERROR(H29/(1+$B$11*F29/36000)+SUM($M$2:$M28),0)","v":7896053.2584641278}]
[null,null,null,"","2027-12-02",4173,182,3.9180555555555552,0,1.8128714351552528,2.6249979895537727,23,{"$f":"IFERROR(H30/(1+$B$11*F30/36000)+SUM($M$2:$M29),0)","v":15792106.478593232}]
[null,null,null,"","2028-06-01",4355,182,3.9180555555555552,0,1.7529492458285632,2.5877508663059312,24,{"$f":"IFERROR(H31/(1+$B$11*F31/36000)+SUM($M$2:$M30),0)","v":31584212.919939339}]
[null,null,null,"","2028-11-30",4537,182,3.9180555555555552,0,1.6950077092409888,2.5515459823196576,25,{"$f":"IFERROR(H32/(1+$B$11*F32/36000)+SUM($M$2:$M31),0)","v":63168425.803673796}]
[null,null,null,"","2029-05-31",4719,182,3.9180555555555552,0,1.6389813574028405,2.5163401956880658,26,{"$f":"IFERROR(H33/(1+$B$11*F33/36000)+SUM($M$2:$M32),0)","v":126336851.5721418}]
[null,null,null,"","2029-11-29",{"$f":"IF(OR(E34-$B$3<=0,E34>$B$4),\"\",E34-$B$3)","v":4901},182,3.9180555555555552,0,1.5848068862866376,2.4820927131560215,27,{"$f":"IFERROR(H34/(1+$B$11*F34/36000)+SUM($M$2:$M33),0)","v":252673703.1100361}]
[null,null,null,"","2030-05-30",5083,182,{"$f":"IF(F35<=0,0,$B$6/36000*G35*100)","v":3.9180555555555552},0,{"$f":"IF(F35=\"\",0,(H35+I35)/(1+$B$7*182/36000)^(F35/182))","v":1.5324230843000524},2.4487649324399925,{"$f":"IF(F35=\"\",\"\",IF(F35=MIN($F:$F),1,L34+1))","v":28},{"$f":"IFERROR(H35/(1+$B$11*F35/36000)+SUM($M$2:$M34),0)","v":505347406.18674445}]
[null,null,null,"","2030-11-28",5265,182,3.9180555555555552,0,1.4817707631230941,{"$f":"IFERROR(H36/(1+$B$11*F36/36000),\"\")","v":2.4163202970828905},29,{"$f":"IFERROR(H36/(1+$B$11*F36/36000)+SUM($M$2:$M35),0)","v":1010694812.3410443}]
[null,null,null,"","2031-05-29",5447,182,3.9180555555555552,0,1.4327926908313811,2.3847241626965383,30,{"$f":"IFERROR(H37/(1+$B$11*F37/36000)+SUM($M$2:$M36),0)","v":2021389624.6504924}]
[null,null,null,"","2031-11-27",5629,182,3.9180555555555552,0,1.385433527229941,2.3539436735628811,31,{"$f":"IFERROR(H38/(1+$B$11*F38/36000)+SUM($M$2:$M37),0)","v":4042779249.2702045}]
[null,null,null,"","2032-05-27",5811,182,3.9180555555555552,0,1.3396397613244695,2.3239476486699271,32,{"$f":"IFERROR(H39/(1+$B$11*F39/36000)+SUM($M$2:$M38),0)","v":8085558498.5104132}]
[null,null,null,"","2032-11-25",5993,182,3.9180555555555552,0,1.2953596508593985,2.294706476351442,33,{"$f":"IFERROR(H40/(1+$B$11*F40/36000)+SUM($M$2:$M39),0)","v":16171116996.991585}]
{"$rows_left_out":21}
{"sheet":"CALCF","index":1,"n_rows":60,"n_cols":9,"rows_kept":60,"cut":false,"hidden":true,"merged":[]}
["Fecha Valuación",{"$f":"+CALC!B5","v":"2016-09-30"},null,null,"Fecha Fin","Dxv","Plazo Cupon"]
["Vencimiento",{"$f":"+CALC!B4","v":"2042-11-13"},null,null,"2013-12-19",{"$f":"IF(OR(E2-$B$1<=0,E2>$B$2),\"\",E2-$B$1)","v":""}]
["Tasa Cupón",{"$f":"+CALC!B6","v":7.75},null,{"$f":"IF(F3=MIN($F:$F),\"VIG\",\"\")","v":""},"2014-06-19","",{"$f":"+E3-E2","v":182}]
["Tasa Yield",6.8196425640906924,null,"","2014-12-18","",182,{"$f":"IF(F4<=0,0,IF(F4=MAX($F:$F),$B$3/36000*G4*100+100,$B$3/36000*G4*100))","v":3.9180555555555552},{"$f":"IF(F4=\"\",0,H4/(1+$B$4*182/36000)^(F4/182))","v":0}]
["Precio Sucio",{"$f":"SUM(I:I)","v":113.60000101409511},null,"","2015-06-18","",182,3.9180555555555552,0]
[null,{"$f":"+B5-CALC!B15","v":-6.0123421425672063E-2},null,"","2015-12-17","",182,3.9180555555555552,0]
[null,null,null,"","2016-06-16","",182,3.9180555555555552,0]
[null,null,null,"VIG","2016-12-15",76,182,3.9180555555555552,3.8629884686033242]
[null,null,null,"","2017-06-15",258,182,3.9180555555555552,3.7342426781348155]
[null,null,null,"","2017-12-14",440,182,3.9180555555555552,3.609787731063351]
[null,null,null,"","2018-06-14",622,182,3.9180555555555552,3.489480622037135]
[null,null,null,"","2018-12-13",804,182,3.9180555555555552,3.3731831117908402]
[null,null,null,"","2019-06-13",986,182,3.9180555555555552,3.2607615683013371]
[null,null,null,"","2019-12-11",1167,181,3.896527777777778,3.1353515350368411]
[null,null,null,"","2020-06-11",1350,183,3.9395833333333332,3.0637759184364084]
[null,null,null,"","2020-12-10",1532,182,3.9180555555555552,2.9454823378711299]
[null,null,null,"","2021-06-10",1714,182,3.9180555555555552,2.8473152180408814]
[null,null,null,"","2021-12-09",1896,182,3.9180555555555552,2.7524198147956773]
[null,null,null,"","2022-06-09",2078,182,3.9180555555555552,2.6606870882713403]
[null,null,null,"","2022-12-08",2260,182,3.9180555555555552,2.5720116326874152]
[null,null,null,"","2023-06-08",2442,182,3.9180555555555552,2.4862915552303204]
[null,null,null,"","2023-12-07",2624,182,3.9180555555555552,2.4034283589730876]
[null,null,null,"","2024-06-06",2806,182,3.9180555555555552,2.3233268296971548]
[null,null,null,"","2024-12-05",2988,182,3.9180555555555552,2.2458949264861672]
[null,null,null,"","2025-06-05",3170,182,3.9180555555555552,2.1710436759660698]
[null,null,null,"","2025-12-04",3352,182,3.9180555555555552,2.0986870700699702]
[null,null,null,"","2026-06-04",3534,182,3.9180555555555552,2.0287419672102955]
[null,null,null,"","2026-12-03",3716,182,3.9180555555555552,1.9611279967446882]
[null,null,null,"","2027-06-03",3898,182,3.9180555555555552,1.8957674666258642]
[null,null,null,"","2027-12-02",4080,182,3.9180555555555552,1.8325852741293194]
[null,null,null,"","2028-06-01",4262,182,3.9180555555555552,1.7715088195563053]
[null,null,null,"","2028-11-30",4444,182,3.9180555555555552,1.7124679228129163]
[null,null,null,"","2029-05-31",4626,182,3.9180555555555552,1.6553947427694289]
[null,null,null,"","2029-11-29",{"$f":"IF(OR(E34-$B$1<=0,E34>$B$2),\"\",E34-$B$1)","v":4808},182,3.9180555555555552,1.6002236993072361]
[null,null,null,{"$f":"IF(F35=MIN($F:$F),\"VIG\",\"\")","v":""},"2030-05-30",4990,{"$f":"+E35-E34","v":182},{"$f":"IF(F35<=0,0,IF(F35=MAX($F:$F),$B$3/36000*G35*100+100,$B$3/36000*G35*100))","v":3.9180555555555552},{"$f":"IF(F35=\"\",0,H35/(1+$B$4*182/36000)^(F35/182))","v":1.546891397963805}]
[null,null,null,"","2030-11-28",5172,182,3.9180555555555552,1.4953365570890684]
[null,null,null,"","2031-05-29",5354,182,3.9180555555555552,1.4454999374295501]
[null,null,null,"","2031-11-27",5536,182,3.9180555555555552,1.3973242740593113]
[null,null,null,"","2032-05-27",5718,182,3.9180555555555552,1.3507542105795094]
[null,null,null,"","2032-11-25",5900,182,3.9180555555555552,1.3057362355109476]
{"$rows_left_out":21}
{"sheet":"Información","index":2,"n_rows":2000,"n_cols":10,"rows_kept":2000,"cut":false,"hidden":false,"merged":[]}
[1,3.81,null,null,"Contrato","Vencimiento","Cupón","Contrato","Vencimiento","# Cupones"]
[2,3.8106511699999999,null,null,"DC18","2018-12-13",8.5,"SP16","2016-09-30",0]
[3,3.8113023300000002,null,null,"JN21","2021-06-10",6.5,"DC16","2016-12-30",1]
[4,3.8119535,null,null,"DC24","2024-12-05",10,"MR17","2017-03-31",1]
[5,3.8126046699999998,null,null,"MY31","2031-05-29",7.75,"JN17","2017-06-30",2]
[6,3.8132558300000001,null,null,"NV42","2042-11-13",7.75]
[7,3.82]
[8,3.8308711400000002]
[9,3.8475132900000002]
[10,3.8660814299999999]
[11,3.88272357]
[12,3.8935947099999999]
[13,3.8948438599999999]
[14,3.89]
[15,3.89221986]
[16,3.8944397099999999]
[17,3.8966595700000002]
[18,3.89887943]
[19,3.9010992899999999]
[20,3.9033191399999998]
[21,3.9]
[22,3.8877798600000002]
[23,3.8703117100000002]
[24,3.85109557]
[25,3.8336274299999999]
[26,3.8214072899999998]
[27,3.8179341400000002]
[28,3.97]
[29,3.97031746]
[30,3.9706349200000002]
[31,3.9709523799999999]
[32,3.9712698400000002]
[33,3.9715872999999999]
[34,3.9719047600000001]
[35,3.9722222199999999]
[36,3.9725396800000001]
[37,3.9728571399999999]
[38,3.9731746000000001]
[39,3.9734920599999999]
[40,3.9738095200000001]
{"$rows_left_out":1961}
{"sheet":"FUTUROS ESPECIFICOS","index":3,"n_rows":48,"n_cols":21,"rows_kept":48,"cut":false,"hidden":false,"merged":[[1,15,1,16],[3,15,3,16]]}
["Contrato","YCash Bid","YFut Bid","Bid","Ask","Y F Ask","YCash Ask","Last","Tasa Fut","Tasa Cash",null,"BID","ASK","LAST",null,null,null,null,"Plazos","DXV","Fondeo"]
[{"$f":"\"DC18 \"&Información!$H$2","v":"DC18 SP16"},null,null,null,null,null,null,null,null,null,null,{"$f":"_xll.rtdValue(L$1,$A2,\"EMD\",\"MXN\")","v":""},{"$f":"_xll.rtdValue(M$1,$A2,\"EMD\",\"MXN\")","v":""},{"$f":"_xll.rtdValue(N$1,$A2,\"EMD\",\"MXN\")","v":""},null,"Fecha Valuación",null,null,{"$f":"+Información!H2","v":"SP16"},{"$f":"VLOOKUP(S2,CTOS_FUT,2,0)-'FUTUROS ESPECIFICOS'!$P$4","v":93},{"$f":"VLOOKUP(T2,Información!$A:$B,2,0)","v":4.2495505600000003}]
[null,null,null,null,null,null,null,null,null,null,null,null,null,null,null,null,null,null,null,null,3.22]
[{"$f":"\"DC18 \"&Información!$H$3","v":"DC18 DC16"},null,null,null,null,null,null,null,null,null,null,{"$f":"_xll.rtdValue(L$1,$A4,\"EMD\",\"MXN\")","v":""},{"$f":"_xll.rtdValue(M$1,$A4,\"EMD\",\"MXN\")","v":""},{"$f":"_xll.rtdValue(N$1,$A4,\"EMD\",\"MXN\")","v":""},null,{"$f":"WORKDAY(TODAY(),2,calendario!$A$1:$A$339)","v":"2016-06-29"},null,null,{"$f":"+Información!H3","v":"DC16"},{"$f":"VLOOKUP(S4,CTOS_FUT,2,0)-'FUTUROS ESPECIFICOS'!$P$4","v":184},{"$f":"VLOOKUP(T4,Información!$A:$B,2,0)","v":4.38954033}]
[null,null,null,null,null,null,null,null,null,null,null,null,null,null,null,null,null,null,null,null,3.3458807199999998]
[{"$f":"\"DC18 \"&Información!$H$4","v":"DC18 MR17"},null,null,null,null,null,null,null,null,null,null,{"$f":"_xll.rtdValue(L$1,$A6,\"EMD\",\"MXN\")","v":""},{"$f":"_xll.rtdValue(M$1,$A6,\"EMD\",\"MXN\")","v":""},{"$f":"_xll.rtdValue(N$1,$A6,\"EMD\",\"MXN\")","v":""},null,null,null,null,{"$f":"+Información!H4","v":"MR17"},{"$f":"VLOOKUP(S6,CTOS_FUT,2,0)-'FUTUROS ESPECIFICOS'!$P$4","v":275},{"$f":"VLOOKUP(T6,Información!$A:$B,2,0)","v":4.41921067}]
[null,null,null,null,null,null,null,null,null,null,null,null,null,null,null,null,null,null,null,null,3.59151833]
[{"$f":"\"DC18 \"&Información!$H$5","v":"DC18 JN17"},null,null,null,null,null,null,null,null,null,null,{"$f":"_xll.rtdValue(L$1,$A8,\"EMD\",\"MXN\")","v":""},{"$f":"_xll.rtdValue(M$1,$A8,\"EMD\",\"MXN\")","v":""},{"$f":"_xll.rtdValue(N$1,$A8,\"EMD\",\"MXN\")","v":""},null,null,null,null,{"$f":"+Información!H5","v":"JN17"},{"$f":"VLOOKUP(S8,CTOS_FUT,2,0)-'FUTUROS ESPECIFICOS'!$P$4","v":366},{"$f":"VLOOKUP(T8,Información!$A:$B,2,0)","v":4.4999719999999996}]
[null,null,null,null,null,null,null,null,null,null,null,null,null,null,null,null,null,null,null,null,3.6003676699999998]
[]
[]
[{"$f":"\"JN21 \"&Información!$H$2","v":"JN21 SP16"},null,null,null,null,null,null,null,null,null,null,{"$f":"_xll.rtdValue(L$1,$A12,\"EMD\",\"MXN\")","v":""},{"$f":"_xll.rtdValue(M$1,$A12,\"EMD\",\"MXN\")","v":""},{"$f":"_xll.rtdValue(N$1,$A12,\"EMD\",\"MXN\")","v":""}]
[]
[{"$f":"\"JN21 \"&Información!$H$3","v":"JN21 DC16"},null,null,null,null,null,null,null,null,null,null,{"$f":"_xll.rtdValue(L$1,$A14,\"EMD\",\"MXN\")","v":""},{"$f":"_xll.rtdValue(M$1,$A14,\"EMD\",\"MXN\")","v":""},{"$f":"_xll.rtdValue(N$1,$A14,\"EMD\",\"MXN\")","v":""}]
[]
[{"$f":"\"JN21 \"&Información!$H$4","v":"JN21 MR17"},null,null,null,null,null,null,null,null,null,null,{"$f":"_xll.rtdValue(L$1,$A16,\"EMD\",\"MXN\")","v":""},{"$f":"_xll.rtdValue(M$1,$A16,\"EMD\",\"MXN\")","v":""},{"$f":"_xll.rtdValue(N$1,$A16,\"EMD\",\"MXN\")","v":""}]
[]
[{"$f":"\"JN21 \"&Información!$H$5","v":"JN21 JN17"},null,null,null,null,null,null,null,null,null,null,{"$f":"_xll.rtdValue(L$1,$A18,\"EMD\",\"MXN\")","v":""},{"$f":"_xll.rtdValue(M$1,$A18,\"EMD\",\"MXN\")","v":""},{"$f":"_xll.rtdValue(N$1,$A18,\"EMD\",\"MXN\")","v":""}]
[]
[]
[]
[{"$f":"\"DC24 \"&Información!$H$2","v":"DC24 SP16"},null,null,null,null,null,null,null,null,null,null,{"$f":"_xll.rtdValue(L$1,$A22,\"EMD\",\"MXN\")","v":""},{"$f":"_xll.rtdValue(M$1,$A22,\"EMD\",\"MXN\")","v":""},{"$f":"_xll.rtdValue(N$1,$A22,\"EMD\",\"MXN\")","v":""}]
[]
[{"$f":"\"DC24 \"&Información!$H$3","v":"DC24 DC16"},null,null,null,null,null,null,null,null,null,null,{"$f":"_xll.rtdValue(L$1,$A24,\"EMD\",\"MXN\")","v":""},{"$f":"_xll.rtdValue(M$1,$A24,\"EMD\",\"MXN\")","v":""},{"$f":"_xll.rtdValue(N$1,$A24,\"EMD\",\"MXN\")","v":""}]
[]
[{"$f":"\"DC24 \"&Información!$H$4","v":"DC24 MR17"},null,null,null,null,null,null,null,null,null,null,{"$f":"_xll.rtdValue(L$1,$A26,\"EMD\",\"MXN\")","v":""},{"$f":"_xll.rtdValue(M$1,$A26,\"EMD\",\"MXN\")","v":""},{"$f":"_xll.rtdValue(N$1,$A26,\"EMD\",\"MXN\")","v":""}]
[]
[{"$f":"\"DC24 \"&Información!$H$5","v":"DC24 JN17"},null,null,null,null,null,null,null,null,null,null,{"$f":"_xll.rtdValue(L$1,$A28,\"EMD\",\"MXN\")","v":""},{"$f":"_xll.rtdValue(M$1,$A28,\"EMD\",\"MXN\")","v":""},{"$f":"_xll.rtdValue(N$1,$A28,\"EMD\",\"MXN\")","v":""}]
[]
[]
[]
[{"$f":"\"MY31 \"&Información!$H$2","v":"MY31 SP16"},null,null,null,null,null,null,null,null,null,null,{"$f":"_xll.rtdValue(L$1,$A32,\"EMD\",\"MXN\")","v":""},{"$f":"_xll.rtdValue(M$1,$A32,\"EMD\",\"MXN\")","v":""},{"$f":"_xll.rtdValue(N$1,$A32,\"EMD\",\"MXN\")","v":""}]
[]
[{"$f":"\"MY31 \"&Información!$H$3","v":"MY31 DC16"},null,null,null,null,null,null,null,null,null,null,{"$f":"_xll.rtdValue(L$1,$A34,\"EMD\",\"MXN\")","v":""},{"$f":"_xll.rtdValue(M$1,$A34,\"EMD\",\"MXN\")","v":""},{"$f":"_xll.rtdValue(N$1,$A34,\"EMD\",\"MXN\")","v":""}]
[]
[{"$f":"\"MY31 \"&Información!$H$4","v":"MY31 MR17"},null,null,null,null,null,null,null,null,null,null,{"$f":"_xll.rtdValue(L$1,$A36,\"EMD\",\"MXN\")","v":""},{"$f":"_xll.rtdValue(M$1,$A36,\"EMD\",\"MXN\")","v":""},{"$f":"_xll.rtdValue(N$1,$A36,\"EMD\",\"MXN\")","v":""}]
[]
[{"$f":"\"MY31 \"&Información!$H$5","v":"MY31 JN17"},null,null,null,null,null,null,null,null,null,null,{"$f":"_xll.rtdValue(L$1,$A38,\"EMD\",\"MXN\")","v":""},{"$f":"_xll.rtdValue(M$1,$A38,\"EMD\",\"MXN\")","v":""},{"$f":"_xll.rtdValue(N$1,$A38,\"EMD\",\"MXN\")","v":""}]
[]
[]
{"$rows_left_out":9}
{"sheet":"calendario","index":4,"n_rows":339,"n_cols":1,"rows_kept":339,"cut":false,"hidden":true,"merged":[]}
["2015-01-01"]
["2015-02-02"]
["2015-03-16"]
["2015-04-02"]
["2015-04-03"]
["2015-05-01"]
["2015-09-16"]
["2015-11-02"]
["2015-11-16"]
["2015-12-25"]
["2016-01-01"]
["2016-02-01"]
["2016-03-21"]
["2016-03-24"]
["2016-03-25"]
["2016-09-16"]
["2016-11-02"]
["2016-11-21"]
["2016-12-12"]
["2017-02-06"]
["2017-03-20"]
["2017-04-13"]
["2017-04-14"]
["2017-05-01"]
["2017-11-02"]
["2017-11-20"]
["2017-12-12"]
["2017-12-25"]
["2018-01-01"]
["2018-02-05"]
["2018-03-19"]
["2018-03-29"]
["2018-03-30"]
["2018-05-01"]
["2018-11-02"]
["2018-11-19"]
["2018-12-12"]
["2018-12-25"]
["2019-01-01"]
["2019-02-04"]
{"$rows_left_out":299}