{"text_format":"1","workbook":"xlsx","n_sheets":5,"sheets":["CALC","CALCF","Información","FUTUROS ESPECIFICOS","calendario"],"not_rendered":{"charts":0,"images":3,"macros":1,"external_links":0,"defined_names":60,"comments":0,"pivot_tables":0},"unopened":[],"bounds":{"document_bytes":16777216,"sheet_cells":100000,"rows_first":2000,"rows_last":500,"rows_between":2000,"halvings":0,"cell_chars":16384,"cell_head_chars":4096},"cells_cut":0,"cells_raw":0,"read":"whole","date_system":"1900"}

{"sheet":"CALC","index":0,"n_rows":60,"n_cols":13,"rows_kept":60,"cut":false,"hidden":true,"merged":[]}
["Emision","NV42",null,null,"Fecha Fin","Dxv","Plazo Cupon","Flujo Cupón","Amort","VP"]
["Contrato","DC15",null,null,"2013-12-19",{"$f":"IF(OR(E2-$B$3<=0,E2>$B$4),\"\",E2-$B$3)","v":""}]
["Fecha Valuación",{"$f":"DIA_VALUACION","v":"2015-12-30"},null,{"$f":"IF(F3=MIN($F:$F),\"VIG\",\"\")","v":""},"2014-06-19","",{"$f":"+E3-E2","v":182},{"$f":"IF(F3<=0,0,$B$6/36000*G3*100)","v":3.9180555555555552},{"$f":"IF(F3=MAX($F:$F),100,0)","v":0},{"$f":"IF(F3=\"\",0,(H3+I3)/(1+$B$7*182/36000)^(F3/182))","v":0},null,{"$f":"IF(F3=\"\",\"\",IF(F3=MIN($F:$F),1,L2+1))","v":""},{"$f":"IFERROR(H3/(1+$B$11*F3/36000)+SUM($M$2:$M2),0)","v":0}]
["Vencimiento",{"$f":"VLOOKUP($B$1,CTOS_CASH,2,0)","v":"2042-11-13"},null,{"$f":"IF(F4=MIN($F:$F),\"VIG\",\"\")","v":""},"2014-12-18","",{"$f":"+E4-E3","v":182},3.9180555555555552,{"$f":"IF(F4=MAX($F:$F),100,0)","v":0},0,{"$f":"IFERROR(H4/(1+$B$11*F4/36000),\"\")","v":""},"",{"$f":"IFERROR(H4/(1+$B$11*F4/36000)+SUM($M$2:$M3),0)","v":0}]
["Venc. Futuro",{"$f":"VLOOKUP($B$2,CTOS_FUT,2,0)","v":{"$error":"#N/A"}},null,"","2015-06-18","",182,3.9180555555555552,0,0,"","",{"$f":"IFERROR(H5/(1+$B$11*F5/36000)+SUM($M$2:$M4),0)","v":0}]
["Tasa Cupón",{"$f":"VLOOKUP($B$1,CTOS_CASH,3,0)","v":7.75},null,"","2015-12-17","",182,3.9180555555555552,0,0,{"$f":"IFERROR(H6/(1+$B$11*F6/36000),\"\")","v":""},"",{"$f":"IFERROR(H6/(1+$B$11*F6/36000)+SUM($M$2:$M5),0)","v":0}]
["Tasa Yield",6.868253473398557,null,"VIG","2016-06-16",169,182,3.9180555555555552,0,3.7958182975953858,"",1,{"$f":"IFERROR(H7/(1+$B$11*F7/36000)+SUM($M$2:$M6),0)","v":0}]
["Precio Sucio",{"$f":"SUM($J:$J)","v":111.07613990950794},null,"","2016-12-15",351,182,3.9180555555555552,0,3.6684396650455211,"",2,{"$f":"IFERROR(H8/(1+$B$11*F8/36000)+SUM($M$2:$M7),0)","v":0}]
["Precio Limpio",{"$f":"+B8-B10","v":110.79627879839683},null,"","2017-06-15",533,182,3.9180555555555552,0,3.5453355563949036,"",3,{"$f":"IFERROR(H9/(1+$B$11*F9/36000)+SUM($M$2:$M8),0)","v":0}]
["Intereses",{"$f":"100*$B$6/36000*(VLOOKUP(\"VIG\",$D:$G,4,0)-VLOOKUP(\"VIG\",$D:$G,3,0))","v":0.27986111111111112},null,"","2017-12-14",715,182,3.9180555555555552,0,3.4263625287897415,"",4,{"$f":"IFERROR(H10/(1+$B$11*F10/36000)+SUM($M$2:$M9),0)","v":0}]
["Fondeo",{"$f":"VLOOKUP($B$2,TABLA_FONDEO,3,0)","v":{"$error":"#N/A"}},null,"","2018-06-14",897,182,3.9180555555555552,0,3.3113819529771904,"",5,{"$f":"IFERROR(H11/(1+$B$11*F11/36000)+SUM($M$2:$M10),0)","v":0}]
["Cupones",{"$f":"VLOOKUP($B$2,CTOS_FUT,3,0)","v":{"$error":"#N/A"}},null,"","2018-12-13",1079,182,3.9180555555555552,0,3.2002598517723611,"",6,{"$f":"IFERROR(H12/(1+$B$11*F12/36000)+SUM($M$2:$M11),0)","v":0}]
["VP Cupón",{"$f":"IFERROR(VLOOKUP($B$12,$L:$M,2,0),0)","v":0},null,"","2019-06-13",1261,182,3.9180555555555552,0,3.0928667439459843,"",7,{"$f":"IFERROR(H13/(1+$B$11*F13/36000)+SUM($M$2:$M12),0)","v":0}]
["DXV FUT",{"$f":"+B5-B3","v":{"$error":"#N/A"}},null,"","2019-12-11",1442,181,3.896527777777778,0,2.9732115560212331,"",8,{"$f":"IFERROR(H14/(1+$B$11*F14/36000)+SUM($M$2:$M13),0)","v":0}]
["Acarreo",{"$f":"(B8-B13)*(1+B11*B14/36000)","v":{"$error":"#N/A"}},null,"","2020-06-11",1625,183,3.9395833333333332,0,2.9046435321391861,"",9,{"$f":"IFERROR(H15/(1+$B$11*F15/36000)+SUM($M$2:$M14),0)","v":0}]
["Tasa Yield",{"$f":"CALCF!B4","v":6.8755579596990559},null,"","2020-12-10",1807,182,3.9180555555555552,0,2.7918308747048641,"",10,{"$f":"IFERROR(H16/(1+$B$11*F16/36000)+SUM($M$2:$M15),0)","v":0}]
[null,null,null,"","2021-06-10",1989,182,3.9180555555555552,0,2.6981436717753455,"",11,{"$f":"IFERROR(H17/(1+$B$11*F17/36000)+SUM($M$2:$M16),0)","v":0}]
[null,null,null,"","2021-12-09",2171,182,3.9180555555555552,0,2.6076003885124095,"",12,{"$f":"IFERROR(H18/(1+$B$11*F18/36000)+SUM($M$2:$M17),0)","v":0}]
[null,null,null,"","2022-06-09",2353,182,3.9180555555555552,0,2.5200955224508217,"",13,{"$f":"IFERROR(H19/(1+$B$11*F19/36000)+SUM($M$2:$M18),0)","v":0}]
[null,null,null,"","2022-12-08",2535,182,3.9180555555555552,0,2.4355271115371124,"",14,{"$f":"IFERROR(H20/(1+$B$11*F20/36000)+SUM($M$2:$M19),0)","v":0}]
[null,null,null,"","2023-06-08",2717,182,3.9180555555555552,0,2.3537966153217775,"",15,{"$f":"IFERROR(H21/(1+$B$11*F21/36000)+SUM($M$2:$M20),0)","v":0}]
[null,null,null,"","2023-12-07",2899,182,3.9180555555555552,0,2.2748088001383886,"",16,{"$f":"IFERROR(H22/(1+$B$11*F22/36000)+SUM($M$2:$M21),0)","v":0}]
[null,null,null,"","2024-06-06",3081,182,3.9180555555555552,0,2.1984716281358225,"",17,{"$f":"IFERROR(H23/(1+$B$11*F23/36000)+SUM($M$2:$M22),0)","v":0}]
[null,null,null,"","2024-12-05",3263,182,3.9180555555555552,0,2.1246961500342976,"",18,{"$f":"IFERROR(H24/(1+$B$11*F24/36000)+SUM($M$2:$M23),0)","v":0}]
[null,null,null,"","2025-06-05",3445,182,3.9180555555555552,0,2.0533964014802693,"",19,{"$f":"IFERROR(H25/(1+$B$11*F25/36000)+SUM($M$2:$M24),0)","v":0}]
[null,null,null,"","2025-12-04",3627,182,3.9180555555555552,0,1.9844893028794048,"",20,{"$f":"IFERROR(H26/(1+$B$11*F26/36000)+SUM($M$2:$M25),0)","v":0}]
[null,null,null,"","2026-06-04",3809,182,3.9180555555555552,0,1.9178945625909281,"",21,{"$f":"IFERROR(H27/(1+$B$11*F27/36000)+SUM($M$2:$M26),0)","v":0}]
[null,null,null,"","2026-12-03",3991,182,3.9180555555555552,0,1.8535345833705279,"",22,{"$f":"IFERROR(H28/(1+$B$11*F28/36000)+SUM($M$2:$M27),0)","v":0}]
[null,null,null,"","2027-06-03",4173,182,3.9180555555555552,0,1.7913343719528239,"",23,{"$f":"IFERROR(H29/(1+$B$11*F29/36000)+SUM($M$2:$M28),0)","v":0}]
[null,null,null,"","2027-12-02",4355,182,3.9180555555555552,0,1.7312214516680282,"",24,{"$f":"IFERROR(H30/(1+$B$11*F30/36000)+SUM($M$2:$M29),0)","v":0}]
[null,null,null,"","2028-06-01",4537,182,3.9180555555555552,0,1.6731257779909809,"",25,{"$f":"IFERROR(H31/(1+$B$11*F31/36000)+SUM($M$2:$M30),0)","v":0}]
[null,null,null,"","2028-11-30",4719,182,3.9180555555555552,0,1.6169796569241666,"",26,{"$f":"IFERROR(H32/(1+$B$11*F32/36000)+SUM($M$2:$M31),0)","v":0}]
[null,null,null,"","2029-05-31",4901,182,3.9180555555555552,0,1.5627176661195936,"",27,{"$f":"IFERROR(H33/(1+$B$11*F33/36000)+SUM($M$2:$M32),0)","v":0}]
[null,null,null,"","2029-11-29",{"$f":"IF(OR(E34-$B$3<=0,E34>$B$4),\"\",E34-$B$3)","v":5083},182,3.9180555555555552,0,1.5102765786476431,"",28,{"$f":"IFERROR(H34/(1+$B$11*F34/36000)+SUM($M$2:$M33),0)","v":0}]
[null,null,null,"","2030-05-30",5265,182,{"$f":"IF(F35<=0,0,$B$6/36000*G35*100)","v":3.9180555555555552},0,{"$f":"IF(F35=\"\",0,(H35+I35)/(1+$B$7*182/36000)^(F35/182))","v":1.4595952893240485},"",{"$f":"IF(F35=\"\",\"\",IF(F35=MIN($F:$F),1,L34+1))","v":29},{"$f":"IFERROR(H35/(1+$B$11*F35/36000)+SUM($M$2:$M34),0)","v":0}]
[null,null,null,"","2030-11-28",5447,182,3.9180555555555552,0,1.4106147435091709,{"$f":"IFERROR(H36/(1+$B$11*F36/36000),\"\")","v":""},30,{"$f":"IFERROR(H36/(1+$B$11*F36/36000)+SUM($M$2:$M35),0)","v":0}]
[null,null,null,"","2031-05-29",5629,182,3.9180555555555552,0,1.3632778682965974,"",31,{"$f":"IFERROR(H37/(1+$B$11*F37/36000)+SUM($M$2:$M36),0)","v":0}]
[null,null,null,"","2031-11-27",5811,182,3.9180555555555552,0,1.3175295060108887,"",32,{"$f":"IFERROR(H38/(1+$B$11*F38/36000)+SUM($M$2:$M37),0)","v":0}]
[null,null,null,"","2032-05-27",5993,182,3.9180555555555552,0,1.2733163499369842,"",33,{"$f":"IFERROR(H39/(1+$B$11*F39/36000)+SUM($M$2:$M38),0)","v":0}]
[null,null,null,"","2032-11-25",6175,182,3.9180555555555552,0,1.2305868822063748,"",34,{"$f":"IFERROR(H40/(1+$B$11*F40/36000)+SUM($M$2:$M39),0)","v":0}]
{"$rows_left_out":21}
{"sheet":"CALCF","index":1,"n_rows":60,"n_cols":9,"rows_kept":60,"cut":false,"hidden":true,"merged":[]}
["Fecha Valuación",{"$f":"+CALC!B5","v":{"$error":"#N/A"}},null,null,"Fecha Fin","Dxv","Plazo Cupon"]
["Vencimiento",{"$f":"+CALC!B4","v":"2042-11-13"},null,null,"2013-12-19",{"$f":"IF(OR(E2-$B$1<=0,E2>$B$2),\"\",E2-$B$1)","v":{"$error":"#N/A"}}]
["Tasa Cupón",{"$f":"+CALC!B6","v":7.75},null,{"$f":"IF(F3=MIN($F:$F),\"VIG\",\"\")","v":{"$error":"#N/A"}},"2014-06-19",{"$error":"#N/A"},{"$f":"+E3-E2","v":182}]
["Tasa Yield",6.8755579596990559,null,{"$error":"#N/A"},"2014-12-18",{"$error":"#N/A"},182,{"$f":"IF(F4<=0,0,IF(F4=MAX($F:$F),$B$3/36000*G4*100+100,$B$3/36000*G4*100))","v":{"$error":"#N/A"}},{"$f":"IF(F4=\"\",0,H4/(1+$B$4*182/36000)^(F4/182))","v":{"$error":"#N/A"}}]
["Precio Sucio",{"$f":"SUM(I:I)","v":{"$error":"#N/A"}},null,{"$error":"#N/A"},"2015-06-18",{"$error":"#N/A"},182,{"$error":"#N/A"},{"$error":"#N/A"}]
[null,{"$f":"+B5-CALC!B15","v":{"$error":"#N/A"}},null,{"$error":"#N/A"},"2015-12-17",{"$error":"#N/A"},182,{"$error":"#N/A"},{"$error":"#N/A"}]
[null,null,null,{"$error":"#N/A"},"2016-06-16",{"$error":"#N/A"},182,{"$error":"#N/A"},{"$error":"#N/A"}]
[null,null,null,{"$error":"#N/A"},"2016-12-15",{"$error":"#N/A"},182,{"$error":"#N/A"},{"$error":"#N/A"}]
[null,null,null,{"$error":"#N/A"},"2017-06-15",{"$error":"#N/A"},182,{"$error":"#N/A"},{"$error":"#N/A"}]
[null,null,null,{"$error":"#N/A"},"2017-12-14",{"$error":"#N/A"},182,{"$error":"#N/A"},{"$error":"#N/A"}]
[null,null,null,{"$error":"#N/A"},"2018-06-14",{"$error":"#N/A"},182,{"$error":"#N/A"},{"$error":"#N/A"}]
[null,null,null,{"$error":"#N/A"},"2018-12-13",{"$error":"#N/A"},182,{"$error":"#N/A"},{"$error":"#N/A"}]
[null,null,null,{"$error":"#N/A"},"2019-06-13",{"$error":"#N/A"},182,{"$error":"#N/A"},{"$error":"#N/A"}]
[null,null,null,{"$error":"#N/A"},"2019-12-11",{"$error":"#N/A"},181,{"$error":"#N/A"},{"$error":"#N/A"}]
[null,null,null,{"$error":"#N/A"},"2020-06-11",{"$error":"#N/A"},183,{"$error":"#N/A"},{"$error":"#N/A"}]
[null,null,null,{"$error":"#N/A"},"2020-12-10",{"$error":"#N/A"},182,{"$error":"#N/A"},{"$error":"#N/A"}]
[null,null,null,{"$error":"#N/A"},"2021-06-10",{"$error":"#N/A"},182,{"$error":"#N/A"},{"$error":"#N/A"}]
[null,null,null,{"$error":"#N/A"},"2021-12-09",{"$error":"#N/A"},182,{"$error":"#N/A"},{"$error":"#N/A"}]
[null,null,null,{"$error":"#N/A"},"2022-06-09",{"$error":"#N/A"},182,{"$error":"#N/A"},{"$error":"#N/A"}]
[null,null,null,{"$error":"#N/A"},"2022-12-08",{"$error":"#N/A"},182,{"$error":"#N/A"},{"$error":"#N/A"}]
[null,null,null,{"$error":"#N/A"},"2023-06-08",{"$error":"#N/A"},182,{"$error":"#N/A"},{"$error":"#N/A"}]
[null,null,null,{"$error":"#N/A"},"2023-12-07",{"$error":"#N/A"},182,{"$error":"#N/A"},{"$error":"#N/A"}]
[null,null,null,{"$error":"#N/A"},"2024-06-06",{"$error":"#N/A"},182,{"$error":"#N/A"},{"$error":"#N/A"}]
[null,null,null,{"$error":"#N/A"},"2024-12-05",{"$error":"#N/A"},182,{"$error":"#N/A"},{"$error":"#N/A"}]
[null,null,null,{"$error":"#N/A"},"2025-06-05",{"$error":"#N/A"},182,{"$error":"#N/A"},{"$error":"#N/A"}]
[null,null,null,{"$error":"#N/A"},"2025-12-04",{"$error":"#N/A"},182,{"$error":"#N/A"},{"$error":"#N/A"}]
[null,null,null,{"$error":"#N/A"},"2026-06-04",{"$error":"#N/A"},182,{"$error":"#N/A"},{"$error":"#N/A"}]
[null,null,null,{"$error":"#N/A"},"2026-12-03",{"$error":"#N/A"},182,{"$error":"#N/A"},{"$error":"#N/A"}]
[null,null,null,{"$error":"#N/A"},"2027-06-03",{"$error":"#N/A"},182,{"$error":"#N/A"},{"$error":"#N/A"}]
[null,null,null,{"$error":"#N/A"},"2027-12-02",{"$error":"#N/A"},182,{"$error":"#N/A"},{"$error":"#N/A"}]
[null,null,null,{"$error":"#N/A"},"2028-06-01",{"$error":"#N/A"},182,{"$error":"#N/A"},{"$error":"#N/A"}]
[null,null,null,{"$error":"#N/A"},"2028-11-30",{"$error":"#N/A"},182,{"$error":"#N/A"},{"$error":"#N/A"}]
[null,null,null,{"$error":"#N/A"},"2029-05-31",{"$error":"#N/A"},182,{"$error":"#N/A"},{"$error":"#N/A"}]
[null,null,null,{"$error":"#N/A"},"2029-11-29",{"$f":"IF(OR(E34-$B$1<=0,E34>$B$2),\"\",E34-$B$1)","v":{"$error":"#N/A"}},182,{"$error":"#N/A"},{"$error":"#N/A"}]
[null,null,null,{"$f":"IF(F35=MIN($F:$F),\"VIG\",\"\")","v":{"$error":"#N/A"}},"2030-05-30",{"$error":"#N/A"},{"$f":"+E35-E34","v":182},{"$f":"IF(F35<=0,0,IF(F35=MAX($F:$F),$B$3/36000*G35*100+100,$B$3/36000*G35*100))","v":{"$error":"#N/A"}},{"$f":"IF(F35=\"\",0,H35/(1+$B$4*182/36000)^(F35/182))","v":{"$error":"#N/A"}}]
[null,null,null,{"$error":"#N/A"},"2030-11-28",{"$error":"#N/A"},182,{"$error":"#N/A"},{"$error":"#N/A"}]
[null,null,null,{"$error":"#N/A"},"2031-05-29",{"$error":"#N/A"},182,{"$error":"#N/A"},{"$error":"#N/A"}]
[null,null,null,{"$error":"#N/A"},"2031-11-27",{"$error":"#N/A"},182,{"$error":"#N/A"},{"$error":"#N/A"}]
[null,null,null,{"$error":"#N/A"},"2032-05-27",{"$error":"#N/A"},182,{"$error":"#N/A"},{"$error":"#N/A"}]
[null,null,null,{"$error":"#N/A"},"2032-11-25",{"$error":"#N/A"},182,{"$error":"#N/A"},{"$error":"#N/A"}]
{"$rows_left_out":21}
{"sheet":"Información","index":2,"n_rows":2000,"n_cols":10,"rows_kept":2000,"cut":false,"hidden":false,"merged":[]}
[1,3.31,null,null,"Contrato","Vencimiento","Cupón","Contrato","Vencimiento","# Cupones"]
[2,3.2983333300000002,null,null,"DC24","2024-12-05",10,"MR16","2016-03-31",0]
[3,3.2866666699999998,null,null,"MY31","2031-05-29",7.75,"JN16","2016-06-30",1]
[4,3.2749999999999999,null,null,"DC18","2018-12-13",8.5,"SP16","2016-09-30",1]
[5,3.26333333,null,null,"NV42","2042-11-13",7.75,"DC16","2016-12-30",2]
[6,3.2516666700000001]
[7,3.24]
[8,3.24]
[9,3.24]
[10,3.24]
[11,3.24]
[12,3.24]
[13,3.24]
[14,3.24]
[15,3.24]
[16,3.24]
[17,3.24]
[18,3.24]
[19,3.24]
[20,3.24]
[21,3.24]
[22,3.2414285700000001]
[23,3.2428571399999999]
[24,3.2442857100000002]
[25,3.24571429]
[26,3.2471428599999999]
[27,3.2485714300000001]
[28,3.25]
[29,3.2492063500000001]
[30,3.2484126999999998]
[31,3.2531580500000001]
[32,3.2666504000000001]
[33,3.2853907499999999]
[34,3.3058790999999998]
[35,3.3246194400000002]
[36,3.3381117900000001]
[37,3.34285714]
[38,3.3420634900000001]
[39,3.3412698399999998]
[40,3.34047619]
{"$rows_left_out":1961}
{"sheet":"FUTUROS ESPECIFICOS","index":3,"n_rows":38,"n_cols":21,"rows_kept":38,"cut":false,"hidden":false,"merged":[[1,15,1,16],[3,15,3,16]]}
["Contrato","YCash Bid","YFut Bid","Bid","Ask","Y F Ask","YCash Ask","Last","Tasa Fut","Tasa Cash",null,"BID","ASK","LAST",null,null,null,null,"Plazos","DXV","Fondeo"]
[{"$f":"\"DC18 \"&Información!$H$2","v":"DC18 MR16"},null,null,null,null,null,null,null,null,null,null,{"$f":"_xll.rtdValue(L$1,$A2,\"EMD\",\"MXN\")","v":{"$error":"#NAME?"}},{"$f":"_xll.rtdValue(M$1,$A2,\"EMD\",\"MXN\")","v":{"$error":"#NAME?"}},{"$f":"_xll.rtdValue(N$1,$A2,\"EMD\",\"MXN\")","v":{"$error":"#NAME?"}},null,"Fecha Valuación",null,null,{"$f":"+Información!H2","v":"MR16"},{"$f":"VLOOKUP(S2,CTOS_FUT,2,0)-'FUTUROS ESPECIFICOS'!$P$4","v":92},{"$f":"VLOOKUP(T2,Información!$A:$B,2,0)","v":3.3300101999999998}]
[null,null,null,null,null,null,null,null,null,null,null,null,null,null,null,null,null,null,null,null,3.22]
[{"$f":"\"DC18 \"&Información!$H$3","v":"DC18 JN16"},null,null,null,null,null,null,null,null,null,null,{"$f":"_xll.rtdValue(L$1,$A4,\"EMD\",\"MXN\")","v":{"$error":"#NAME?"}},{"$f":"_xll.rtdValue(M$1,$A4,\"EMD\",\"MXN\")","v":{"$error":"#NAME?"}},{"$f":"_xll.rtdValue(N$1,$A4,\"EMD\",\"MXN\")","v":{"$error":"#NAME?"}},null,{"$f":"WORKDAY(TODAY(),2,calendario!$A$1:$A$339)","v":"2015-12-30"},null,null,{"$f":"+Información!H3","v":"JN16"},{"$f":"VLOOKUP(S4,CTOS_FUT,2,0)-'FUTUROS ESPECIFICOS'!$P$4","v":183},{"$f":"VLOOKUP(T4,Información!$A:$B,2,0)","v":3.5508928700000002}]
[null,null,null,null,null,null,null,null,null,null,null,null,null,null,null,null,null,null,null,null,3.3458807199999998]
[{"$f":"\"DC18 \"&Información!$H$4","v":"DC18 SP16"},null,null,null,null,null,null,null,null,null,null,{"$f":"_xll.rtdValue(L$1,$A6,\"EMD\",\"MXN\")","v":{"$error":"#NAME?"}},{"$f":"_xll.rtdValue(M$1,$A6,\"EMD\",\"MXN\")","v":{"$error":"#NAME?"}},{"$f":"_xll.rtdValue(N$1,$A6,\"EMD\",\"MXN\")","v":{"$error":"#NAME?"}},null,null,null,null,{"$f":"+Información!H4","v":"SP16"},{"$f":"VLOOKUP(S6,CTOS_FUT,2,0)-'FUTUROS ESPECIFICOS'!$P$4","v":275},{"$f":"VLOOKUP(T6,Información!$A:$B,2,0)","v":3.6418737800000001}]
[null,null,null,null,null,null,null,null,null,null,null,null,null,null,null,null,null,null,null,null,3.59151833]
[{"$f":"\"DC18 \"&Información!$H$5","v":"DC18 DC16"},null,null,null,null,null,null,null,null,null,null,{"$f":"_xll.rtdValue(L$1,$A8,\"EMD\",\"MXN\")","v":{"$error":"#NAME?"}},{"$f":"_xll.rtdValue(M$1,$A8,\"EMD\",\"MXN\")","v":{"$error":"#NAME?"}},{"$f":"_xll.rtdValue(N$1,$A8,\"EMD\",\"MXN\")","v":{"$error":"#NAME?"}},null,null,null,null,{"$f":"+Información!H5","v":"DC16"},{"$f":"VLOOKUP(S8,CTOS_FUT,2,0)-'FUTUROS ESPECIFICOS'!$P$4","v":366},{"$f":"VLOOKUP(T8,Información!$A:$B,2,0)","v":3.6503519999999998}]
[null,null,null,null,null,null,null,null,null,null,null,null,null,null,null,null,null,null,null,null,3.6003676699999998]
[]
[]
[{"$f":"\"DC24 \"&Información!$H$2","v":"DC24 MR16"},null,null,null,null,null,null,null,null,null,null,{"$f":"_xll.rtdValue(L$1,$A12,\"EMD\",\"MXN\")","v":{"$error":"#NAME?"}},{"$f":"_xll.rtdValue(M$1,$A12,\"EMD\",\"MXN\")","v":{"$error":"#NAME?"}},{"$f":"_xll.rtdValue(N$1,$A12,\"EMD\",\"MXN\")","v":{"$error":"#NAME?"}}]
[]
[{"$f":"\"DC24 \"&Información!$H$3","v":"DC24 JN16"},null,null,null,null,null,null,null,null,null,null,{"$f":"_xll.rtdValue(L$1,$A14,\"EMD\",\"MXN\")","v":{"$error":"#NAME?"}},{"$f":"_xll.rtdValue(M$1,$A14,\"EMD\",\"MXN\")","v":{"$error":"#NAME?"}},{"$f":"_xll.rtdValue(N$1,$A14,\"EMD\",\"MXN\")","v":{"$error":"#NAME?"}}]
[]
[{"$f":"\"DC24 \"&Información!$H$4","v":"DC24 SP16"},null,null,null,null,null,null,null,null,null,null,{"$f":"_xll.rtdValue(L$1,$A16,\"EMD\",\"MXN\")","v":{"$error":"#NAME?"}},{"$f":"_xll.rtdValue(M$1,$A16,\"EMD\",\"MXN\")","v":{"$error":"#NAME?"}},{"$f":"_xll.rtdValue(N$1,$A16,\"EMD\",\"MXN\")","v":{"$error":"#NAME?"}}]
[]
[{"$f":"\"DC24 \"&Información!$H$5","v":"DC24 DC16"},null,null,null,null,null,null,null,null,null,null,{"$f":"_xll.rtdValue(L$1,$A18,\"EMD\",\"MXN\")","v":{"$error":"#NAME?"}},{"$f":"_xll.rtdValue(M$1,$A18,\"EMD\",\"MXN\")","v":{"$error":"#NAME?"}},{"$f":"_xll.rtdValue(N$1,$A18,\"EMD\",\"MXN\")","v":{"$error":"#NAME?"}}]
[]
[]
[]
[{"$f":"\"MY31 \"&Información!$H$2","v":"MY31 MR16"},null,null,null,null,null,null,null,null,null,null,{"$f":"_xll.rtdValue(L$1,$A22,\"EMD\",\"MXN\")","v":{"$error":"#NAME?"}},{"$f":"_xll.rtdValue(M$1,$A22,\"EMD\",\"MXN\")","v":{"$error":"#NAME?"}},{"$f":"_xll.rtdValue(N$1,$A22,\"EMD\",\"MXN\")","v":{"$error":"#NAME?"}}]
[]
[{"$f":"\"MY31 \"&Información!$H$3","v":"MY31 JN16"},null,null,null,null,null,null,null,null,null,null,{"$f":"_xll.rtdValue(L$1,$A24,\"EMD\",\"MXN\")","v":{"$error":"#NAME?"}},{"$f":"_xll.rtdValue(M$1,$A24,\"EMD\",\"MXN\")","v":{"$error":"#NAME?"}},{"$f":"_xll.rtdValue(N$1,$A24,\"EMD\",\"MXN\")","v":{"$error":"#NAME?"}}]
[]
[{"$f":"\"MY31 \"&Información!$H$4","v":"MY31 SP16"},null,null,null,null,null,null,null,null,null,null,{"$f":"_xll.rtdValue(L$1,$A26,\"EMD\",\"MXN\")","v":{"$error":"#NAME?"}},{"$f":"_xll.rtdValue(M$1,$A26,\"EMD\",\"MXN\")","v":{"$error":"#NAME?"}},{"$f":"_xll.rtdValue(N$1,$A26,\"EMD\",\"MXN\")","v":{"$error":"#NAME?"}}]
[]
[{"$f":"\"MY31 \"&Información!$H$5","v":"MY31 DC16"},null,null,null,null,null,null,null,null,null,null,{"$f":"_xll.rtdValue(L$1,$A28,\"EMD\",\"MXN\")","v":{"$error":"#NAME?"}},{"$f":"_xll.rtdValue(M$1,$A28,\"EMD\",\"MXN\")","v":{"$error":"#NAME?"}},{"$f":"_xll.rtdValue(N$1,$A28,\"EMD\",\"MXN\")","v":{"$error":"#NAME?"}}]
[]
[]
[]
[{"$f":"\"NV42 \"&Información!$H$2","v":"NV42 MR16"},null,null,null,null,null,null,null,null,null,null,{"$f":"_xll.rtdValue(L$1,$A32,\"EMD\",\"MXN\")","v":{"$error":"#NAME?"}},{"$f":"_xll.rtdValue(M$1,$A32,\"EMD\",\"MXN\")","v":{"$error":"#NAME?"}},{"$f":"_xll.rtdValue(N$1,$A32,\"EMD\",\"MXN\")","v":{"$error":"#NAME?"}}]
[]
[{"$f":"\"NV42 \"&Información!$H$3","v":"NV42 JN16"},null,null,null,null,null,null,null,null,null,null,{"$f":"_xll.rtdValue(L$1,$A34,\"EMD\",\"MXN\")","v":{"$error":"#NAME?"}},{"$f":"_xll.rtdValue(M$1,$A34,\"EMD\",\"MXN\")","v":{"$error":"#NAME?"}},{"$f":"_xll.rtdValue(N$1,$A34,\"EMD\",\"MXN\")","v":{"$error":"#NAME?"}}]
[]
[{"$f":"\"NV42 \"&Información!$H$4","v":"NV42 SP16"},null,null,null,null,null,null,null,null,null,null,{"$f":"_xll.rtdValue(L$1,$A36,\"EMD\",\"MXN\")","v":{"$error":"#NAME?"}},{"$f":"_xll.rtdValue(M$1,$A36,\"EMD\",\"MXN\")","v":{"$error":"#NAME?"}},{"$f":"_xll.rtdValue(N$1,$A36,\"EMD\",\"MXN\")","v":{"$error":"#NAME?"}}]
[]
[{"$f":"\"NV42 \"&Información!$H$5","v":"NV42 DC16"},null,null,null,null,null,null,null,null,null,null,{"$f":"_xll.rtdValue(L$1,$A38,\"EMD\",\"MXN\")","v":{"$error":"#NAME?"}},{"$f":"_xll.rtdValue(M$1,$A38,\"EMD\",\"MXN\")","v":{"$error":"#NAME?"}},{"$f":"_xll.rtdValue(N$1,$A38,\"EMD\",\"MXN\")","v":{"$error":"#NAME?"}}]

{"sheet":"calendario","index":4,"n_rows":339,"n_cols":1,"rows_kept":339,"cut":false,"hidden":true,"merged":[]}
["2015-01-01"]
["2015-02-02"]
["2015-03-16"]
["2015-04-02"]
["2015-04-03"]
["2015-05-01"]
["2015-09-16"]
["2015-11-02"]
["2015-11-16"]
["2015-12-25"]
["2016-01-01"]
["2016-02-01"]
["2016-03-21"]
["2016-03-24"]
["2016-03-25"]
["2016-09-16"]
["2016-11-02"]
["2016-11-21"]
["2016-12-12"]
["2017-02-06"]
["2017-03-20"]
["2017-04-13"]
["2017-04-14"]
["2017-05-01"]
["2017-11-02"]
["2017-11-20"]
["2017-12-12"]
["2017-12-25"]
["2018-01-01"]
["2018-02-05"]
["2018-03-19"]
["2018-03-29"]
["2018-03-30"]
["2018-05-01"]
["2018-11-02"]
["2018-11-19"]
["2018-12-12"]
["2018-12-25"]
["2019-01-01"]
["2019-02-04"]
{"$rows_left_out":299}