{"text_format":"1","workbook":"xlsx","n_sheets":5,"sheets":["CALC","CALCF","Información","FUTUROS ESPECIFICOS","calendario"],"not_rendered":{"charts":0,"images":3,"macros":1,"external_links":0,"defined_names":60,"comments":0,"pivot_tables":0},"unopened":[],"bounds":{"document_bytes":16777216,"sheet_cells":100000,"rows_first":2000,"rows_last":500,"rows_between":2000,"halvings":0,"cell_chars":16384,"cell_head_chars":4096},"cells_cut":0,"cells_raw":0,"read":"whole","date_system":"1900"}

{"sheet":"CALC","index":0,"n_rows":60,"n_cols":13,"rows_kept":60,"cut":false,"hidden":true,"merged":[]}
["Emision","NV42",null,null,"Fecha Fin","Dxv","Plazo Cupon","Flujo Cupón","Amort","VP"]
["Contrato","SP16",null,null,"2013-12-19",{"$f":"IF(OR(E2-$B$3<=0,E2>$B$4),\"\",E2-$B$3)","v":""}]
["Fecha Valuación",{"$f":"DIA_VALUACION","v":"2015-11-06"},null,{"$f":"IF(F3=MIN($F:$F),\"VIG\",\"\")","v":""},"2014-06-19","",{"$f":"+E3-E2","v":182},{"$f":"IF(F3<=0,0,$B$6/36000*G3*100)","v":3.9180555555555552},{"$f":"IF(F3=MAX($F:$F),100,0)","v":0},{"$f":"IF(F3=\"\",0,(H3+I3)/(1+$B$7*182/36000)^(F3/182))","v":0},null,{"$f":"IF(F3=\"\",\"\",IF(F3=MIN($F:$F),1,L2+1))","v":""},{"$f":"IFERROR(H3/(1+$B$11*F3/36000)+SUM($M$2:$M2),0)","v":0}]
["Vencimiento",{"$f":"VLOOKUP($B$1,CTOS_CASH,2,0)","v":"2042-11-13"},null,{"$f":"IF(F4=MIN($F:$F),\"VIG\",\"\")","v":""},"2014-12-18","",{"$f":"+E4-E3","v":182},3.9180555555555552,{"$f":"IF(F4=MAX($F:$F),100,0)","v":0},0,{"$f":"IFERROR(H4/(1+$B$11*F4/36000),\"\")","v":""},"",{"$f":"IFERROR(H4/(1+$B$11*F4/36000)+SUM($M$2:$M3),0)","v":0}]
["Venc. Futuro",{"$f":"VLOOKUP($B$2,CTOS_FUT,2,0)","v":"2016-09-30"},null,"","2015-06-18","",182,3.9180555555555552,0,0,"","",{"$f":"IFERROR(H5/(1+$B$11*F5/36000)+SUM($M$2:$M4),0)","v":0}]
["Tasa Cupón",{"$f":"VLOOKUP($B$1,CTOS_CASH,3,0)","v":7.75},null,"VIG","2015-12-17",41,182,3.9180555555555552,0,3.8886342819114312,{"$f":"IFERROR(H6/(1+$B$11*F6/36000),\"\")","v":3.9021356697116318},1,{"$f":"IFERROR(H6/(1+$B$11*F6/36000)+SUM($M$2:$M5),0)","v":3.9021356697116318}]
["Tasa Yield",6.7302476853020909,null,"","2016-06-16",223,182,3.9180555555555552,0,3.760676725776797,3.8330010107932089,2,{"$f":"IFERROR(H7/(1+$B$11*F7/36000)+SUM($M$2:$M6),0)","v":7.7351366805048407}]
["Precio Sucio",{"$f":"SUM($J:$J)","v":115.70678623500761},null,"","2016-12-15",405,182,3.9180555555555552,0,3.6369296803214803,3.7662734411274661,3,{"$f":"IFERROR(H8/(1+$B$11*F8/36000)+SUM($M$2:$M7),0)","v":15.403545791343937}]
["Precio Limpio",{"$f":"+B8-B10","v":112.67136956834095},null,"","2017-06-15",587,182,3.9180555555555552,0,3.5172545964772102,3.7018293988722246,4,{"$f":"IFERROR(H9/(1+$B$11*F9/36000)+SUM($M$2:$M8),0)","v":30.742647540432632}]
["Intereses",{"$f":"100*$B$6/36000*(VLOOKUP(\"VIG\",$D:$G,4,0)-VLOOKUP(\"VIG\",$D:$G,3,0))","v":3.0354166666666664},null,"","2017-12-14",769,182,3.9180555555555552,0,3.4015174842056726,3.6395536368935684,5,{"$f":"IFERROR(H10/(1+$B$11*F10/36000)+SUM($M$2:$M9),0)","v":61.423019318886602}]
["Fondeo",{"$f":"VLOOKUP($B$2,TABLA_FONDEO,3,0)","v":3.5822527800000001},null,"","2018-06-14",951,182,3.9180555555555552,0,3.2895887624812312,3.5793385349466029,6,{"$f":"IFERROR(H11/(1+$B$11*F11/36000)+SUM($M$2:$M10),0)","v":122.78582353582624}]
["Cupones",{"$f":"VLOOKUP($B$2,CTOS_FUT,3,0)","v":2},null,"","2018-12-13",1133,182,3.9180555555555552,0,3.1813431142100463,3.5210834790232814,7,{"$f":"IFERROR(H12/(1+$B$11*F12/36000)+SUM($M$2:$M11),0)","v":245.51339201572915}]
["VP Cupón",{"$f":"VLOOKUP($B$12,$L:$M,2,0)","v":7.7351366805048407},null,"","2019-06-13",1315,182,3.9180555555555552,0,3.0766593459231584,3.4646943003376731,8,{"$f":"IFERROR(H13/(1+$B$11*F13/36000)+SUM($M$2:$M12),0)","v":490.9703948527727}]
["DXV FUT",{"$f":"+B5-B3","v":329},null,"","2019-12-11",1496,181,3.896527777777778,0,2.9596158383455862,3.3916397852739912,9,{"$f":"IFERROR(H14/(1+$B$11*F14/36000)+SUM($M$2:$M13),0)","v":981.86773519048177}]
["Acarreo",{"$f":"(B8-B13)*(1+B11*B14/36000)","v":111.50640491686103},null,"","2020-06-11",1679,183,3.9395833333333332,0,2.8933229920286681,3.3756120929165738,10,{"$f":"IFERROR(H15/(1+$B$11*F15/36000)+SUM($M$2:$M14),0)","v":1963.719442688606}]
["Tasa Yield",{"$f":"CALCF!B4","v":6.9882146498870057},null,"","2020-12-10",1861,182,3.9180555555555552,0,2.7828264222686467,3.3058666770721814,11,{"$f":"IFERROR(H16/(1+$B$11*F16/36000)+SUM($M$2:$M15),0)","v":3927.3691399613676}]
[null,null,null,"","2021-06-10",2043,182,3.9180555555555552,0,2.6912560553157134,3.2561114037810852,12,{"$f":"IFERROR(H17/(1+$B$11*F17/36000)+SUM($M$2:$M16),0)","v":7854.6885246494439}]
[null,null,null,"","2021-12-09",2225,182,3.9180555555555552,0,2.6026988594455314,3.2078316168569816,13,{"$f":"IFERROR(H18/(1+$B$11*F18/36000)+SUM($M$2:$M17),0)","v":15709.328769511963}]
[null,null,null,"","2022-06-09",2407,182,3.9180555555555552,0,2.5170556846789527,3.1609626422071595,14,{"$f":"IFERROR(H19/(1+$B$11*F19/36000)+SUM($M$2:$M18),0)","v":31418.610670049275}]
[null,null,null,"","2022-12-08",2589,182,3.9180555555555552,0,2.4342306436190375,3.1154435310688742,15,{"$f":"IFERROR(H20/(1+$B$11*F20/36000)+SUM($M$2:$M19),0)","v":62837.17582098741}]
[null,null,null,"","2023-06-08",2771,182,3.9180555555555552,0,2.3541310040940715,3.0712167955860292,16,{"$f":"IFERROR(H21/(1+$B$11*F21/36000)+SUM($M$2:$M20),0)","v":125674.30741523932}]
[null,null,null,"","2023-12-07",2953,182,3.9180555555555552,0,2.2766670853332194,3.0282281665930775,17,{"$f":"IFERROR(H22/(1+$B$11*F22/36000)+SUM($M$2:$M21),0)","v":251348.57184184968}]
[null,null,null,"","2024-06-06",3135,182,3.9180555555555552,0,2.2017521575585755,2.9864263714602863,18,{"$f":"IFERROR(H23/(1+$B$11*F23/36000)+SUM($M$2:$M22),0)","v":502697.10188190424}]
[null,null,null,"","2024-12-05",3317,182,3.9180555555555552,0,2.1293023448811872,2.9457629300882786,19,{"$f":"IFERROR(H24/(1+$B$11*F24/36000)+SUM($M$2:$M23),0)","v":1005394.1631003671}]
[null,null,null,"","2025-06-05",3499,182,3.9180555555555552,0,2.0592365313923402,2.9061919673452201,20,{"$f":"IFERROR(H25/(1+$B$11*F25/36000)+SUM($M$2:$M24),0)","v":2010788.2866297713}]
[null,null,null,"","2025-12-04",3681,182,3.9180555555555552,0,1.991476270344956,2.8676700404210176,21,{"$f":"IFERROR(H26/(1+$B$11*F26/36000)+SUM($M$2:$M25),0)","v":4021576.5347376158}]
[null,null,null,"","2026-06-04",3863,182,3.9180555555555552,0,1.9259456963234258,2.8301559797325413,22,{"$f":"IFERROR(H27/(1+$B$11*F27/36000)+SUM($M$2:$M26),0)","v":8043153.031961171}]
[null,null,null,"","2026-12-03",4045,182,3.9180555555555552,0,1.8625714403035394,2.7936107421550003,23,{"$f":"IFERROR(H28/(1+$B$11*F28/36000)+SUM($M$2:$M27),0)","v":16086306.027377104}]
[null,null,null,"","2027-06-03",4227,182,3.9180555555555552,0,1.8012825475074139,2.7579972754795223,24,{"$f":"IFERROR(H29/(1+$B$11*F29/36000)+SUM($M$2:$M28),0)","v":32172612.019140743}]
[null,null,null,"","2027-12-02",4409,182,3.9180555555555552,0,1.7420103979614499,2.7232803931077458,25,{"$f":"IFERROR(H30/(1+$B$11*F30/36000)+SUM($M$2:$M29),0)","v":64345224.003564604}]
[null,null,null,"","2028-06-01",4591,182,3.9180555555555552,0,1.6846886296683661,2.6894266580926209,26,{"$f":"IFERROR(H31/(1+$B$11*F31/36000)+SUM($M$2:$M30),0)","v":128690447.97327548}]
[null,null,null,"","2028-11-30",4773,182,3.9180555555555552,0,1.6292530643073035,2.6564042757221022,27,{"$f":"IFERROR(H32/(1+$B$11*F32/36000)+SUM($M$2:$M31),0)","v":257380895.91352859}]
[null,null,null,"","2029-05-31",4955,182,3.9180555555555552,0,1.5756416353788025,2.6241829939203853,28,{"$f":"IFERROR(H33/(1+$B$11*F33/36000)+SUM($M$2:$M32),0)","v":514761791.79483587}]
[null,null,null,"","2029-11-29",{"$f":"IF(OR(E34-$B$3<=0,E34>$B$4),\"\",E34-$B$3)","v":5137},182,3.9180555555555552,0,1.5237943187142104,2.5927340108108683,29,{"$f":"IFERROR(H34/(1+$B$11*F34/36000)+SUM($M$2:$M33),0)","v":1029523583.5582227}]
[null,null,null,"","2030-05-30",5319,182,{"$f":"IF(F35<=0,0,$B$6/36000*G35*100)","v":3.9180555555555552},0,{"$f":"IF(F35=\"\",0,(H35+I35)/(1+$B$7*182/36000)^(F35/182))","v":1.4736530652717115},2.5620298888471558,{"$f":"IF(F35=\"\",\"\",IF(F35=MIN($F:$F),1,L34+1))","v":30},{"$f":"IFERROR(H35/(1+$B$11*F35/36000)+SUM($M$2:$M34),0)","v":2059047167.085741}]
[null,null,null,"","2030-11-28",5501,182,3.9180555555555552,0,1.4251617361437399,{"$f":"IFERROR(H36/(1+$B$11*F36/36000),\"\")","v":2.5320444749740099},31,{"$f":"IFERROR(H36/(1+$B$11*F36/36000)+SUM($M$2:$M35),0)","v":4118094334.1414967}]
[null,null,null,"","2031-05-29",5683,182,3.9180555555555552,0,1.3782660397030069,2.5027528263299503,32,{"$f":"IFERROR(H37/(1+$B$11*F37/36000)+SUM($M$2:$M36),0)","v":8236188668.2537022}]
[null,null,null,"","2031-11-27",5865,182,3.9180555555555552,0,1.3329134708167736,2.4741311410478839,33,{"$f":"IFERROR(H38/(1+$B$11*F38/36000)+SUM($M$2:$M37),0)","v":16472377336.478781}]
[null,null,null,"","2032-05-27",6047,182,3.9180555555555552,0,1.2890532520613056,2.4461566937502628,34,{"$f":"IFERROR(H39/(1+$B$11*F39/36000)+SUM($M$2:$M38),0)","v":32944754672.929585}]
[null,null,null,"","2032-11-25",6229,182,3.9180555555555552,0,1.246636276870702,2.4188077753713668,35,{"$f":"IFERROR(H40/(1+$B$11*F40/36000)+SUM($M$2:$M39),0)","v":65889509345.831818}]
{"$rows_left_out":21}
{"sheet":"CALCF","index":1,"n_rows":60,"n_cols":9,"rows_kept":60,"cut":false,"hidden":true,"merged":[]}
["Fecha Valuación",{"$f":"+CALC!B5","v":"2016-09-30"},null,null,"Fecha Fin","Dxv","Plazo Cupon"]
["Vencimiento",{"$f":"+CALC!B4","v":"2042-11-13"},null,null,"2013-12-19",{"$f":"IF(OR(E2-$B$1<=0,E2>$B$2),\"\",E2-$B$1)","v":""}]
["Tasa Cupón",{"$f":"+CALC!B6","v":7.75},null,{"$f":"IF(F3=MIN($F:$F),\"VIG\",\"\")","v":""},"2014-06-19","",{"$f":"+E3-E2","v":182}]
["Tasa Yield",6.9882146498870057,null,"","2014-12-18","",182,{"$f":"IF(F4<=0,0,IF(F4=MAX($F:$F),$B$3/36000*G4*100+100,$B$3/36000*G4*100))","v":3.9180555555555552},{"$f":"IF(F4=\"\",0,H4/(1+$B$4*182/36000)^(F4/182))","v":0}]
["Precio Sucio",{"$f":"SUM(I:I)","v":111.40000153026591},null,"","2015-06-18","",182,3.9180555555555552,0]
[null,{"$f":"+B5-CALC!B15","v":-0.10640338659511883},null,"","2015-12-17","",182,3.9180555555555552,0]
[null,null,null,"","2016-06-16","",182,3.9180555555555552,0]
[null,null,null,"VIG","2016-12-15",76,182,3.9180555555555552,3.8616603226848425]
[null,null,null,"","2017-06-15",258,182,3.9180555555555552,3.7298860324885785]
[null,null,null,"","2017-12-14",440,182,3.9180555555555552,3.6026083738201375]
[null,null,null,"","2018-06-14",622,182,3.9180555555555552,3.4796739047974441]
[null,null,null,"","2018-12-13",804,182,3.9180555555555552,3.3609344195492055]
[null,null,null,"","2019-06-13",986,182,3.9180555555555552,3.246246769542648]
[null,null,null,"","2019-12-11",1167,181,3.896527777777778,3.1188397332355788]
[null,null,null,"","2020-06-11",1350,183,3.9395833333333332,3.0451186307710523]
[null,null,null,"","2020-12-10",1532,182,3.9180555555555552,2.9251356226632144]
[null,null,null,"","2021-06-10",1714,182,3.9180555555555552,2.8253190571978553]
[null,null,null,"","2021-12-09",1896,182,3.9180555555555552,2.7289086061923205]
[null,null,null,"","2022-06-09",2078,182,3.9180555555555552,2.6357880402846865]
[null,null,null,"","2022-12-08",2260,182,3.9180555555555552,2.545845096293478]
[null,null,null,"","2023-06-08",2442,182,3.9180555555555552,2.4589713418767585]
[null,null,null,"","2023-12-07",2624,182,3.9180555555555552,2.375062044809563]
[null,null,null,"","2024-06-06",2806,182,3.9180555555555552,2.2940160467220694]
[null,null,null,"","2024-12-05",2988,182,3.9180555555555552,2.2157356411462961]
[null,null,null,"","2025-06-05",3170,182,3.9180555555555552,2.1401264557243072]
[null,null,null,"","2025-12-04",3352,182,3.9180555555555552,2.0670973384359055]
[null,null,null,"","2026-06-04",3534,182,3.9180555555555552,1.9965602477086726]
[null,null,null,"","2026-12-03",3716,182,3.9180555555555552,1.9284301462778537]
[null,null,null,"","2027-06-03",3898,182,3.9180555555555552,1.8626248986681511]
[null,null,null,"","2027-12-02",4080,182,3.9180555555555552,1.7990651721738131]
[null,null,null,"","2028-06-01",4262,182,3.9180555555555552,1.7376743412176616]
[null,null,null,"","2028-11-30",4444,182,3.9180555555555552,1.6783783949737368]
[null,null,null,"","2029-05-31",4626,182,3.9180555555555552,1.621105848142212]
[null,null,null,"","2029-11-29",{"$f":"IF(OR(E34-$B$1<=0,E34>$B$2),\"\",E34-$B$1)","v":4808},182,3.9180555555555552,1.5657876547689968]
[null,null,null,{"$f":"IF(F35=MIN($F:$F),\"VIG\",\"\")","v":""},"2030-05-30",4990,{"$f":"+E35-E34","v":182},{"$f":"IF(F35<=0,0,IF(F35=MAX($F:$F),$B$3/36000*G35*100+100,$B$3/36000*G35*100))","v":3.9180555555555552},{"$f":"IF(F35=\"\",0,H35/(1+$B$4*182/36000)^(F35/182))","v":1.5123571250061398}]
[null,null,null,"","2030-11-28",5172,182,3.9180555555555552,1.4607498447126754]
[null,null,null,"","2031-05-29",5354,182,3.9180555555555552,1.4109035977989941]
[null,null,null,"","2031-11-27",5536,182,3.9180555555555552,1.3627582912211085]
[null,null,null,"","2032-05-27",5718,182,3.9180555555555552,1.3162558825344008]
[null,null,null,"","2032-11-25",5900,182,3.9180555555555552,1.2713403099195011]
{"$rows_left_out":21}
{"sheet":"Información","index":2,"n_rows":2000,"n_cols":10,"rows_kept":2000,"cut":false,"hidden":false,"merged":[]}
[1,3.06,null,null,"Contrato","Vencimiento","Cupón","Contrato","Vencimiento","# Cupones"]
[2,3.06666667,null,null,"DC24","2024-12-05",10,"DC15","2015-12-31",1]
[3,3.0733333300000001,null,null,"MY31","2031-05-29",7.75,"MR16","2016-03-31",1]
[4,3.08,null,null,"DC18","2018-12-13",8.5,"JN16","2016-06-30",2]
[5,3.0866666700000001,null,null,"NV42","2042-11-13",7.75,"SP16","2016-09-30",2]
[6,3.0933333300000001]
[7,3.1]
[8,3.1014285699999999]
[9,3.1028571399999998]
[10,3.1042857100000001]
[11,3.1057142899999999]
[12,3.1071428600000002]
[13,3.10857143]
[14,3.11]
[15,3.11]
[16,3.11]
[17,3.11]
[18,3.11]
[19,3.11]
[20,3.11]
[21,3.11]
[22,3.10857143]
[23,3.1071428600000002]
[24,3.10675429]
[25,3.1078057100000001]
[26,3.1093371400000001]
[27,3.11038857]
[28,3.11]
[29,3.10984127]
[30,3.1096825400000001]
[31,3.11039881]
[32,3.1125530800000001]
[33,3.11567835]
[34,3.1193096200000001]
[35,3.1229798899999999]
[36,3.1262231599999999]
[37,3.12857143]
[38,3.1299576999999998]
[39,3.1308199700000001]
[40,3.1314482400000001]
{"$rows_left_out":1961}
{"sheet":"FUTUROS ESPECIFICOS","index":3,"n_rows":38,"n_cols":21,"rows_kept":38,"cut":false,"hidden":false,"merged":[[1,15,1,16],[3,15,3,16]]}
["Contrato","YCash Bid","YFut Bid","Bid","Ask","Y F Ask","YCash Ask","Last","Tasa Fut","Tasa Cash",null,"BID","ASK","LAST",null,null,null,null,"Plazos","DXV","Fondeo"]
[{"$f":"\"DC18 \"&Información!$H$2","v":"DC18 DC15"},null,null,null,null,null,null,null,null,null,null,{"$f":"_xll.rtdValue(L$1,$A2,\"EMD\",\"MXN\")","v":{"$error":"#NAME?"}},{"$f":"_xll.rtdValue(M$1,$A2,\"EMD\",\"MXN\")","v":{"$error":"#NAME?"}},{"$f":"_xll.rtdValue(N$1,$A2,\"EMD\",\"MXN\")","v":{"$error":"#NAME?"}},null,"Fecha Valuación",null,null,{"$f":"+Información!H2","v":"DC15"},{"$f":"VLOOKUP(S2,CTOS_FUT,2,0)-'FUTUROS ESPECIFICOS'!$P$4","v":55},{"$f":"VLOOKUP(T2,Información!$A:$B,2,0)","v":3.17352729}]
[]
[{"$f":"\"DC18 \"&Información!$H$3","v":"DC18 MR16"},null,null,null,null,null,null,null,null,null,null,{"$f":"_xll.rtdValue(L$1,$A4,\"EMD\",\"MXN\")","v":{"$error":"#NAME?"}},{"$f":"_xll.rtdValue(M$1,$A4,\"EMD\",\"MXN\")","v":{"$error":"#NAME?"}},{"$f":"_xll.rtdValue(N$1,$A4,\"EMD\",\"MXN\")","v":{"$error":"#NAME?"}},null,{"$f":"WORKDAY(TODAY(),2,calendario!$A$1:$A$339)","v":"2015-11-06"},null,null,{"$f":"+Información!H3","v":"MR16"},{"$f":"VLOOKUP(S4,CTOS_FUT,2,0)-'FUTUROS ESPECIFICOS'!$P$4","v":146},{"$f":"VLOOKUP(T4,Información!$A:$B,2,0)","v":3.2576404499999998}]
[]
[{"$f":"\"DC18 \"&Información!$H$4","v":"DC18 JN16"},null,null,null,null,null,null,null,null,null,null,{"$f":"_xll.rtdValue(L$1,$A6,\"EMD\",\"MXN\")","v":{"$error":"#NAME?"}},{"$f":"_xll.rtdValue(M$1,$A6,\"EMD\",\"MXN\")","v":{"$error":"#NAME?"}},{"$f":"_xll.rtdValue(N$1,$A6,\"EMD\",\"MXN\")","v":{"$error":"#NAME?"}},null,null,null,null,{"$f":"+Información!H4","v":"JN16"},{"$f":"VLOOKUP(S6,CTOS_FUT,2,0)-'FUTUROS ESPECIFICOS'!$P$4","v":237},{"$f":"VLOOKUP(T6,Información!$A:$B,2,0)","v":3.4396466700000001}]
[]
[{"$f":"\"DC18 \"&Información!$H$5","v":"DC18 SP16"},null,null,null,null,null,null,null,null,null,null,{"$f":"_xll.rtdValue(L$1,$A8,\"EMD\",\"MXN\")","v":{"$error":"#NAME?"}},{"$f":"_xll.rtdValue(M$1,$A8,\"EMD\",\"MXN\")","v":{"$error":"#NAME?"}},{"$f":"_xll.rtdValue(N$1,$A8,\"EMD\",\"MXN\")","v":{"$error":"#NAME?"}},null,null,null,null,{"$f":"+Información!H5","v":"SP16"},{"$f":"VLOOKUP(S8,CTOS_FUT,2,0)-'FUTUROS ESPECIFICOS'!$P$4","v":329},{"$f":"VLOOKUP(T8,Información!$A:$B,2,0)","v":3.5822527800000001}]
[]
[]
[]
[{"$f":"\"DC24 \"&Información!$H$2","v":"DC24 DC15"},null,null,null,null,null,null,null,null,null,null,{"$f":"_xll.rtdValue(L$1,$A12,\"EMD\",\"MXN\")","v":{"$error":"#NAME?"}},{"$f":"_xll.rtdValue(M$1,$A12,\"EMD\",\"MXN\")","v":{"$error":"#NAME?"}},{"$f":"_xll.rtdValue(N$1,$A12,\"EMD\",\"MXN\")","v":{"$error":"#NAME?"}}]
[]
[{"$f":"\"DC24 \"&Información!$H$3","v":"DC24 MR16"},null,null,null,null,null,null,null,null,null,null,{"$f":"_xll.rtdValue(L$1,$A14,\"EMD\",\"MXN\")","v":{"$error":"#NAME?"}},{"$f":"_xll.rtdValue(M$1,$A14,\"EMD\",\"MXN\")","v":{"$error":"#NAME?"}},{"$f":"_xll.rtdValue(N$1,$A14,\"EMD\",\"MXN\")","v":{"$error":"#NAME?"}}]
[]
[{"$f":"\"DC24 \"&Información!$H$4","v":"DC24 JN16"},null,null,null,null,null,null,null,null,null,null,{"$f":"_xll.rtdValue(L$1,$A16,\"EMD\",\"MXN\")","v":{"$error":"#NAME?"}},{"$f":"_xll.rtdValue(M$1,$A16,\"EMD\",\"MXN\")","v":{"$error":"#NAME?"}},{"$f":"_xll.rtdValue(N$1,$A16,\"EMD\",\"MXN\")","v":{"$error":"#NAME?"}}]
[]
[{"$f":"\"DC24 \"&Información!$H$5","v":"DC24 SP16"},null,null,null,null,null,null,null,null,null,null,{"$f":"_xll.rtdValue(L$1,$A18,\"EMD\",\"MXN\")","v":{"$error":"#NAME?"}},{"$f":"_xll.rtdValue(M$1,$A18,\"EMD\",\"MXN\")","v":{"$error":"#NAME?"}},{"$f":"_xll.rtdValue(N$1,$A18,\"EMD\",\"MXN\")","v":{"$error":"#NAME?"}}]
[]
[]
[]
[{"$f":"\"MY31 \"&Información!$H$2","v":"MY31 DC15"},null,null,null,null,null,null,null,null,null,null,{"$f":"_xll.rtdValue(L$1,$A22,\"EMD\",\"MXN\")","v":{"$error":"#NAME?"}},{"$f":"_xll.rtdValue(M$1,$A22,\"EMD\",\"MXN\")","v":{"$error":"#NAME?"}},{"$f":"_xll.rtdValue(N$1,$A22,\"EMD\",\"MXN\")","v":{"$error":"#NAME?"}}]
[]
[{"$f":"\"MY31 \"&Información!$H$3","v":"MY31 MR16"},null,null,null,null,null,null,null,null,null,null,{"$f":"_xll.rtdValue(L$1,$A24,\"EMD\",\"MXN\")","v":{"$error":"#NAME?"}},{"$f":"_xll.rtdValue(M$1,$A24,\"EMD\",\"MXN\")","v":{"$error":"#NAME?"}},{"$f":"_xll.rtdValue(N$1,$A24,\"EMD\",\"MXN\")","v":{"$error":"#NAME?"}}]
[]
[{"$f":"\"MY31 \"&Información!$H$4","v":"MY31 JN16"},null,null,null,null,null,null,null,null,null,null,{"$f":"_xll.rtdValue(L$1,$A26,\"EMD\",\"MXN\")","v":{"$error":"#NAME?"}},{"$f":"_xll.rtdValue(M$1,$A26,\"EMD\",\"MXN\")","v":{"$error":"#NAME?"}},{"$f":"_xll.rtdValue(N$1,$A26,\"EMD\",\"MXN\")","v":{"$error":"#NAME?"}}]
[]
[{"$f":"\"MY31 \"&Información!$H$5","v":"MY31 SP16"},null,null,null,null,null,null,null,null,null,null,{"$f":"_xll.rtdValue(L$1,$A28,\"EMD\",\"MXN\")","v":{"$error":"#NAME?"}},{"$f":"_xll.rtdValue(M$1,$A28,\"EMD\",\"MXN\")","v":{"$error":"#NAME?"}},{"$f":"_xll.rtdValue(N$1,$A28,\"EMD\",\"MXN\")","v":{"$error":"#NAME?"}}]
[]
[]
[]
[{"$f":"\"NV42 \"&Información!$H$2","v":"NV42 DC15"},null,null,null,null,null,null,null,null,null,null,{"$f":"_xll.rtdValue(L$1,$A32,\"EMD\",\"MXN\")","v":{"$error":"#NAME?"}},{"$f":"_xll.rtdValue(M$1,$A32,\"EMD\",\"MXN\")","v":{"$error":"#NAME?"}},{"$f":"_xll.rtdValue(N$1,$A32,\"EMD\",\"MXN\")","v":{"$error":"#NAME?"}}]
[]
[{"$f":"\"NV42 \"&Información!$H$3","v":"NV42 MR16"},null,null,null,null,null,null,null,null,null,null,{"$f":"_xll.rtdValue(L$1,$A34,\"EMD\",\"MXN\")","v":{"$error":"#NAME?"}},{"$f":"_xll.rtdValue(M$1,$A34,\"EMD\",\"MXN\")","v":{"$error":"#NAME?"}},{"$f":"_xll.rtdValue(N$1,$A34,\"EMD\",\"MXN\")","v":{"$error":"#NAME?"}}]
[]
[{"$f":"\"NV42 \"&Información!$H$4","v":"NV42 JN16"},null,null,null,null,null,null,null,null,null,null,{"$f":"_xll.rtdValue(L$1,$A36,\"EMD\",\"MXN\")","v":{"$error":"#NAME?"}},{"$f":"_xll.rtdValue(M$1,$A36,\"EMD\",\"MXN\")","v":{"$error":"#NAME?"}},{"$f":"_xll.rtdValue(N$1,$A36,\"EMD\",\"MXN\")","v":{"$error":"#NAME?"}}]
[]
[{"$f":"\"NV42 \"&Información!$H$5","v":"NV42 SP16"},null,null,null,null,null,null,null,null,null,null,{"$f":"_xll.rtdValue(L$1,$A38,\"EMD\",\"MXN\")","v":{"$error":"#NAME?"}},{"$f":"_xll.rtdValue(M$1,$A38,\"EMD\",\"MXN\")","v":{"$error":"#NAME?"}},{"$f":"_xll.rtdValue(N$1,$A38,\"EMD\",\"MXN\")","v":{"$error":"#NAME?"}}]

{"sheet":"calendario","index":4,"n_rows":339,"n_cols":1,"rows_kept":339,"cut":false,"hidden":true,"merged":[]}
["2015-01-01"]
["2015-02-02"]
["2015-03-16"]
["2015-04-02"]
["2015-04-03"]
["2015-05-01"]
["2015-09-16"]
["2015-11-02"]
["2015-11-16"]
["2015-12-25"]
["2016-01-01"]
["2016-02-01"]
["2016-03-21"]
["2016-03-24"]
["2016-03-25"]
["2016-09-16"]
["2016-11-02"]
["2016-11-21"]
["2016-12-12"]
["2017-02-06"]
["2017-03-20"]
["2017-04-13"]
["2017-04-14"]
["2017-05-01"]
["2017-11-02"]
["2017-11-20"]
["2017-12-12"]
["2017-12-25"]
["2018-01-01"]
["2018-02-05"]
["2018-03-19"]
["2018-03-29"]
["2018-03-30"]
["2018-05-01"]
["2018-11-02"]
["2018-11-19"]
["2018-12-12"]
["2018-12-25"]
["2019-01-01"]
["2019-02-04"]
{"$rows_left_out":299}