{"text_format":"1","workbook":"xlsx","n_sheets":5,"sheets":["CALC","CALCF","Información","FUTUROS ESPECIFICOS","calendario"],"not_rendered":{"charts":0,"images":3,"macros":1,"external_links":0,"defined_names":61,"comments":0,"pivot_tables":0},"unopened":[],"bounds":{"document_bytes":16777216,"sheet_cells":100000,"rows_first":2000,"rows_last":500,"rows_between":2000,"halvings":0,"cell_chars":16384,"cell_head_chars":4096},"cells_cut":0,"cells_raw":0,"read":"whole","date_system":"1900"}

{"sheet":"CALC","index":0,"n_rows":60,"n_cols":17,"rows_kept":60,"cut":false,"hidden":true,"merged":[]}
["Emision","MR26",null,null,"Fecha Fin","Dxv","Plazo Cupon","Flujo Cupón","Amort","VP",null,null,null,null,null,"Fecha Fin Fung","Fecha Fin No Fung"]
["Contrato","DC16",null,null,{"$f":"IF($B$1=\"MR26\",Q2,P2)","v":"2016-09-15"},{"$f":"IF(OR(E2-$B$3<=0,E2>$B$4),\"\",E2-$B$3)","v":""},null,null,null,null,null,null,null,null,null,"2013-12-19","2016-09-15"]
["Fecha Valuación",{"$f":"DIA_VALUACION","v":"2016-11-10"},null,{"$f":"IF(F3=MIN($F:$F),\"VIG\",\"\")","v":"VIG"},{"$f":"IF($B$1=\"MR26\",Q3,P3)","v":"2017-03-16"},126,{"$f":"IF(E3-E2<0,0,E3-E2)","v":182},{"$f":"IF(F3<=0,0,$B$6/36000*G3*100)","v":2.9069444444444446},{"$f":"IF(F3=MAX($F:$F),100,0)","v":0},{"$f":"IF(F3=\"\",0,(H3+I3)/(1+$B$7*182/36000)^(F3/182))","v":2.8447187840232742},null,{"$f":"IF(F3=\"\",\"\",IF(F3=MIN($F:$F),1,L2+1))","v":1},{"$f":"IFERROR(H3/(1+$B$11*F3/36000)+SUM($M$2:$M2),0)","v":2.856908214012158},null,null,"2014-06-19","2017-03-16"]
["Vencimiento",{"$f":"VLOOKUP($B$1,CTOS_CASH,2,0)","v":"2026-03-05"},null,{"$f":"IF(F4=MIN($F:$F),\"VIG\",\"\")","v":""},"2017-09-14",308,{"$f":"IF(E4-E3<0,0,E4-E3)","v":182},2.9069444444444446,{"$f":"IF(F4=MAX($F:$F),100,0)","v":0},2.7571813400126932,{"$f":"IFERROR(H4/(1+$B$11*F4/36000),\"\")","v":2.7876008653164006},2,{"$f":"IFERROR(H4/(1+$B$11*F4/36000)+SUM($M$2:$M3),0)","v":5.6445090793285591},null,null,"2014-12-18","2017-09-14"]
["Venc. Futuro",{"$f":"VLOOKUP($B$2,CTOS_FUT,2,0)","v":"2016-12-30"},null,"","2018-03-15",490,182,2.9069444444444446,0,2.672337590769744,2.7215766025589803,3,{"$f":"IFERROR(H5/(1+$B$11*F5/36000)+SUM($M$2:$M4),0)","v":11.222993895899698},null,null,"2015-06-18","2018-03-15"]
["Tasa Cupón",{"$f":"VLOOKUP($B$1,CTOS_CASH,3,0)","v":5.75},null,"","2018-09-13",672,182,2.9069444444444446,0,2.5901046461485779,{"$f":"IFERROR(H6/(1+$B$11*F6/36000),\"\")","v":2.6586075436752399},4,{"$f":"IFERROR(H6/(1+$B$11*F6/36000)+SUM($M$2:$M5),0)","v":22.383018732915652},null,null,"2015-12-17","2018-09-13"]
["Tasa Yield",6.28,null,"","2019-03-14",854,182,2.9069444444444446,0,2.5104021666918523,2.5984864196855888,5,{"$f":"IFERROR(H7/(1+$B$11*F7/36000)+SUM($M$2:$M6),0)","v":44.705916341841657},null,null,"2016-06-16","2019-03-14"]
["Precio Sucio",{"$f":"SUM($J:$J)","v":97.150589265068163},null,"","2019-09-12",1036,182,2.9069444444444446,0,2.4331522851411598,2.5410242955385991,6,{"$f":"IFERROR(H8/(1+$B$11*F8/36000)+SUM($M$2:$M7),0)","v":89.354370559536321},null,null,"2016-12-15","2019-09-12"]
["Precio Limpio",{"$f":"+B8-B10","v":96.256144820623717},null,"","2020-03-12",1218,182,2.9069444444444446,0,2.3582795303627324,2.4860485868149436,7,{"$f":"IFERROR(H9/(1+$B$11*F9/36000)+SUM($M$2:$M8),0)","v":178.65376541034897},null,null,"2017-06-15","2020-03-12"]
["Intereses",{"$f":"100*$B$6/36000*(VLOOKUP(\"VIG\",$D:$G,4,0)-VLOOKUP(\"VIG\",$D:$G,3,0))","v":0.89444444444444438},null,"","2020-09-10",1400,182,2.9069444444444446,0,2.2857107536140999,2.433401328433896,8,{"$f":"IFERROR(H10/(1+$B$11*F10/36000)+SUM($M$2:$M9),0)","v":357.25488356231688},null,null,"2017-12-14","2020-09-10"]
["Fondeo",{"$f":"VLOOKUP($B$2,TABLA_FONDEO,3,0)","v":5.0040339999999999},null,"","2021-03-11",1582,182,2.9069444444444446,0,2.2153750570796622,2.3829376587803339,9,{"$f":"IFERROR(H11/(1+$B$11*F11/36000)+SUM($M$2:$M10),0)","v":714.45930345498016},null,null,"2018-06-14","2021-03-11"]
["Cupones",{"$f":"TRUNC(($B$5-(VLOOKUP(\"VIG\",$D:$G,2,0)-VLOOKUP(\"VIG\",$D:$G,4,0)))/180,0)","v":0},null,"","2021-09-09",1764,182,2.9069444444444446,0,2.1472037246053581,2.3345244886159664,10,{"$f":"IFERROR(H12/(1+$B$11*F12/36000)+SUM($M$2:$M11),0)","v":1428.8701937397959},null,null,"2018-12-13","2021-09-09"]
["VP Cupón",{"$f":"IFERROR(VLOOKUP($B$12,$L:$M,2,0),0)","v":0},null,"","2022-03-10",1946,182,2.9069444444444446,0,2.0811301545647658,2.2880393290187788,11,{"$f":"IFERROR(H13/(1+$B$11*F13/36000)+SUM($M$2:$M12),0)","v":2857.6939023199948},null,null,"2019-06-13","2022-03-10"]
["DXV FUT",{"$f":"+B5-B3","v":50},null,"","2022-09-08",2128,182,2.9069444444444446,0,2.0170897947910338,2.2433692566173931,12,{"$f":"IFERROR(H14/(1+$B$11*F14/36000)+SUM($M$2:$M13),0)","v":5715.3431345675881},null,null,"2019-12-11","2022-09-08"]
["Acarreo",{"$f":"(B8-B13)*(1+B11*B14/36000)","v":97.825790448127094},null,"","2023-03-09",2310,182,2.9069444444444446,0,1.9550200795110897,2.2004099977165064,13,{"$f":"IFERROR(H15/(1+$B$11*F15/36000)+SUM($M$2:$M14),0)","v":11430.643309876275},null,null,"2020-06-11","2023-03-09"]
["Tasa Yield",{"$f":"CALCF!B4","v":5.8921618622642766},null,"","2023-09-07",2492,182,2.9069444444444446,0,1.8948603682204981,2.1590651156759768,14,{"$f":"IFERROR(H16/(1+$B$11*F16/36000)+SUM($M$2:$M15),0)","v":22861.245274870511},null,null,"2020-12-10","2023-09-07"]
[null,null,null,"","2024-03-07",2674,182,2.9069444444444446,0,1.8365518864392587,2.119245288213341,15,{"$f":"IFERROR(H17/(1+$B$11*F17/36000)+SUM($M$2:$M16),0)","v":45722.450729913566},null,null,"2021-06-10","2024-03-07"]
[null,null,null,"","2024-09-05",2856,182,2.9069444444444446,0,1.7800376682906618,2.0808676632307415,16,{"$f":"IFERROR(H18/(1+$B$11*F18/36000)+SUM($M$2:$M17),0)","v":91444.863082202151},null,null,"2021-12-09","2024-09-05"]
[null,null,null,"","2025-03-06",3038,182,2.9069444444444446,0,1.7252625008471005,2.0438552833892625,17,{"$f":"IFERROR(H19/(1+$B$11*F19/36000)+SUM($M$2:$M18),0)","v":182889.68915202445},null,null,"2022-06-09","2025-03-06"]
[null,null,null,"","2025-09-04",3220,182,2.9069444444444446,0,1.6721728701884726,2.0081365710206036,18,{"$f":"IFERROR(H20/(1+$B$11*F20/36000)+SUM($M$2:$M19),0)","v":365779.34258533653},null,null,"2022-12-08","2025-09-04"]
[null,null,null,"","2026-03-05",3402,182,2.9069444444444446,100,57.37399806376613,1.973644866121627,19,{"$f":"IFERROR(H21/(1+$B$11*F21/36000)+SUM($M$2:$M20),0)","v":731558.65067896817},null,null,"2023-06-08","2026-03-05"]
[null,null,null,"","00:00:00","",0,0,0,0,"","",{"$f":"IFERROR(H22/(1+$B$11*F22/36000)+SUM($M$2:$M21),0)","v":0},null,null,"2023-12-07"]
[null,null,null,"","00:00:00","",0,0,0,0,"","",{"$f":"IFERROR(H23/(1+$B$11*F23/36000)+SUM($M$2:$M22),0)","v":0},null,null,"2024-06-06"]
[null,null,null,"","00:00:00","",0,0,0,0,"","",{"$f":"IFERROR(H24/(1+$B$11*F24/36000)+SUM($M$2:$M23),0)","v":0},null,null,"2024-12-05"]
[null,null,null,"","00:00:00","",0,0,0,0,"","",{"$f":"IFERROR(H25/(1+$B$11*F25/36000)+SUM($M$2:$M24),0)","v":0},null,null,"2025-06-05"]
[null,null,null,"","00:00:00","",0,0,0,0,"","",{"$f":"IFERROR(H26/(1+$B$11*F26/36000)+SUM($M$2:$M25),0)","v":0},null,null,"2025-12-04"]
[null,null,null,"","00:00:00","",0,0,0,0,"","",{"$f":"IFERROR(H27/(1+$B$11*F27/36000)+SUM($M$2:$M26),0)","v":0},null,null,"2026-06-04"]
[null,null,null,"","00:00:00","",0,0,0,0,"","",{"$f":"IFERROR(H28/(1+$B$11*F28/36000)+SUM($M$2:$M27),0)","v":0},null,null,"2026-12-03"]
[null,null,null,"","00:00:00","",0,0,0,0,"","",{"$f":"IFERROR(H29/(1+$B$11*F29/36000)+SUM($M$2:$M28),0)","v":0},null,null,"2027-06-03"]
[null,null,null,"","00:00:00","",0,0,0,0,"","",{"$f":"IFERROR(H30/(1+$B$11*F30/36000)+SUM($M$2:$M29),0)","v":0},null,null,"2027-12-02"]
[null,null,null,"","00:00:00","",0,0,0,0,"","",{"$f":"IFERROR(H31/(1+$B$11*F31/36000)+SUM($M$2:$M30),0)","v":0},null,null,"2028-06-01"]
[null,null,null,"","00:00:00","",0,0,0,0,"","",{"$f":"IFERROR(H32/(1+$B$11*F32/36000)+SUM($M$2:$M31),0)","v":0},null,null,"2028-11-30"]
[null,null,null,"","00:00:00","",0,0,0,0,"","",{"$f":"IFERROR(H33/(1+$B$11*F33/36000)+SUM($M$2:$M32),0)","v":0},null,null,"2029-05-31"]
[null,null,null,"","00:00:00",{"$f":"IF(OR(E34-$B$3<=0,E34>$B$4),\"\",E34-$B$3)","v":""},0,0,0,0,"","",{"$f":"IFERROR(H34/(1+$B$11*F34/36000)+SUM($M$2:$M33),0)","v":0},null,null,"2029-11-29"]
[null,null,null,"","00:00:00","",0,{"$f":"IF(F35<=0,0,$B$6/36000*G35*100)","v":0},0,{"$f":"IF(F35=\"\",0,(H35+I35)/(1+$B$7*182/36000)^(F35/182))","v":0},"",{"$f":"IF(F35=\"\",\"\",IF(F35=MIN($F:$F),1,L34+1))","v":""},{"$f":"IFERROR(H35/(1+$B$11*F35/36000)+SUM($M$2:$M34),0)","v":0},null,null,"2030-05-30"]
[null,null,null,"","00:00:00","",0,0,0,0,{"$f":"IFERROR(H36/(1+$B$11*F36/36000),\"\")","v":""},"",{"$f":"IFERROR(H36/(1+$B$11*F36/36000)+SUM($M$2:$M35),0)","v":0},null,null,"2030-11-28"]
[null,null,null,"","00:00:00","",0,0,0,0,"","",{"$f":"IFERROR(H37/(1+$B$11*F37/36000)+SUM($M$2:$M36),0)","v":0},null,null,"2031-05-29"]
[null,null,null,"","00:00:00","",0,0,0,0,"","",{"$f":"IFERROR(H38/(1+$B$11*F38/36000)+SUM($M$2:$M37),0)","v":0},null,null,"2031-11-27"]
[null,null,null,"","00:00:00","",0,0,0,0,"","",{"$f":"IFERROR(H39/(1+$B$11*F39/36000)+SUM($M$2:$M38),0)","v":0},null,null,"2032-05-27"]
[null,null,null,"","00:00:00","",0,0,0,0,"","",{"$f":"IFERROR(H40/(1+$B$11*F40/36000)+SUM($M$2:$M39),0)","v":0},null,null,"2032-11-25"]
{"$rows_left_out":21}
{"sheet":"CALCF","index":1,"n_rows":60,"n_cols":17,"rows_kept":60,"cut":false,"hidden":true,"merged":[]}
["Fecha Valuación",{"$f":"+CALC!B5","v":"2016-12-30"},null,null,"Fecha Fin","Dxv","Plazo Cupon",null,null,null,null,null,null,null,null,"Fecha Fin Fung","Fecha Fin No Fung"]
["Vencimiento",{"$f":"+CALC!B4","v":"2026-03-05"},null,null,{"$f":"IF(CALC!$B$1=\"MR26\",Q2,P2)","v":"2016-09-15"},{"$f":"IF(OR(E2-$B$1<=0,E2>$B$2),\"\",E2-$B$1)","v":""},null,null,null,null,null,null,null,null,null,"2013-12-19","2016-09-15"]
["Tasa Cupón",{"$f":"+CALC!B6","v":5.75},null,{"$f":"IF(F3=MIN($F:$F),\"VIG\",\"\")","v":"VIG"},{"$f":"IF(CALC!$B$1=\"MR26\",Q3,P3)","v":"2017-03-16"},76,{"$f":"IF(E3-E2<0,0,E3-E2)","v":182},null,null,null,null,null,null,null,null,"2014-06-19","2017-03-16"]
["Tasa Yield",5.8921618622642766,null,"",{"$f":"IF(CALC!$B$1=\"MR26\",Q4,P4)","v":"2017-09-14"},258,{"$f":"IF(E4-E3<0,0,E4-E3)","v":182},{"$f":"IF(F4<=0,0,IF(F4=MAX($F:$F),$B$3/36000*G4*100+100,$B$3/36000*G4*100))","v":2.9069444444444446},{"$f":"IF(F4=\"\",0,H4/(1+$B$4*182/36000)^(F4/182))","v":2.7884672374996855},null,null,null,null,null,null,"2014-12-18","2017-09-14"]
["Precio Sucio",{"$f":"SUM(I:I)","v":97.803563633809006},null,"",{"$f":"IF(CALC!$B$1=\"MR26\",Q5,P5)","v":"2018-03-15"},440,182,2.9069444444444446,2.7078066814684147,null,null,null,null,null,null,"2015-06-18","2018-03-15"]
[null,{"$f":"+B5-CALC!B15","v":-2.2226814318088373E-2},null,"",{"$f":"IF(CALC!$B$1=\"MR26\",Q6,P6)","v":"2018-09-13"},622,182,2.9069444444444446,2.6294793518103217,null,null,null,null,null,null,"2015-12-17","2018-09-13"]
[null,null,null,"",{"$f":"IF(CALC!$B$1=\"MR26\",Q7,P7)","v":"2019-03-14"},804,182,2.9069444444444446,2.5534177564874581,null,null,null,null,null,null,"2016-06-16","2019-03-14"]
[null,null,null,"",{"$f":"IF(CALC!$B$1=\"MR26\",Q8,P8)","v":"2019-09-12"},986,182,2.9069444444444446,2.4795563557693079,null,null,null,null,null,null,"2016-12-15","2019-09-12"]
[null,null,null,"",{"$f":"IF(CALC!$B$1=\"MR26\",Q9,P9)","v":"2020-03-12"},1168,182,2.9069444444444446,2.4078315057593951,null,null,null,null,null,null,"2017-06-15","2020-03-12"]
[null,null,null,"",{"$f":"IF(CALC!$B$1=\"MR26\",Q10,P10)","v":"2020-09-10"},1350,182,2.9069444444444446,2.3381814035554647,null,null,null,null,null,null,"2017-12-14","2020-09-10"]
[null,null,null,"",{"$f":"IF(CALC!$B$1=\"MR26\",Q11,P11)","v":"2021-03-11"},1532,182,2.9069444444444446,2.2705460339959971,null,null,null,null,null,null,"2018-06-14","2021-03-11"]
[null,null,null,"",{"$f":"IF(CALC!$B$1=\"MR26\",Q12,P12)","v":"2021-09-09"},1714,182,2.9069444444444446,2.2048671179471464,null,null,null,null,null,null,"2018-12-13","2021-09-09"]
[null,null,null,"",{"$f":"IF(CALC!$B$1=\"MR26\",Q13,P13)","v":"2022-03-10"},1896,182,2.9069444444444446,2.1410880620855655,null,null,null,null,null,null,"2019-06-13","2022-03-10"]
[null,null,null,"",{"$f":"IF(CALC!$B$1=\"MR26\",Q14,P14)","v":"2022-09-08"},2078,182,2.9069444444444446,2.0791539101338321,null,null,null,null,null,null,"2019-12-11","2022-09-08"]
[null,null,null,"",{"$f":"IF(CALC!$B$1=\"MR26\",Q15,P15)","v":"2023-03-09"},2260,182,2.9069444444444446,2.0190112955064641,null,null,null,null,null,null,"2020-06-11","2023-03-09"]
[null,null,null,"",{"$f":"IF(CALC!$B$1=\"MR26\",Q16,P16)","v":"2023-09-07"},2442,182,2.9069444444444446,1.9606083953257212,null,null,null,null,null,null,"2020-12-10","2023-09-07"]
[null,null,null,"",{"$f":"IF(CALC!$B$1=\"MR26\",Q17,P17)","v":"2024-03-07"},2624,182,2.9069444444444446,1.903894885767563,null,null,null,null,null,null,"2021-06-10","2024-03-07"]
[null,null,null,"",{"$f":"IF(CALC!$B$1=\"MR26\",Q18,P18)","v":"2024-09-05"},2806,182,2.9069444444444446,1.8488218986992973,null,null,null,null,null,null,"2021-12-09","2024-09-05"]
[null,null,null,"",{"$f":"IF(CALC!$B$1=\"MR26\",Q19,P19)","v":"2025-03-06"},2988,182,2.9069444444444446,1.7953419795715437,null,null,null,null,null,null,"2022-06-09","2025-03-06"]
[null,null,null,"",{"$f":"IF(CALC!$B$1=\"MR26\",Q20,P20)","v":"2025-09-04"},3170,182,2.9069444444444446,1.7434090465282384,null,null,null,null,null,null,"2022-12-08","2025-09-04"]
[null,null,null,"",{"$f":"IF(CALC!$B$1=\"MR26\",Q21,P21)","v":"2026-03-05"},3352,182,102.90694444444445,59.932080715897591,null,null,null,null,null,null,"2023-06-08","2026-03-05"]
[null,null,null,"",{"$f":"IF(CALC!$B$1=\"MR26\",Q22,P22)","v":"00:00:00"},"",0,0,0,null,null,null,null,null,null,"2023-12-07"]
[null,null,null,"",{"$f":"IF(CALC!$B$1=\"MR26\",Q23,P23)","v":"00:00:00"},"",0,0,0,null,null,null,null,null,null,"2024-06-06"]
[null,null,null,"",{"$f":"IF(CALC!$B$1=\"MR26\",Q24,P24)","v":"00:00:00"},"",0,0,0,null,null,null,null,null,null,"2024-12-05"]
[null,null,null,"",{"$f":"IF(CALC!$B$1=\"MR26\",Q25,P25)","v":"00:00:00"},"",0,0,0,null,null,null,null,null,null,"2025-06-05"]
[null,null,null,"",{"$f":"IF(CALC!$B$1=\"MR26\",Q26,P26)","v":"00:00:00"},"",0,0,0,null,null,null,null,null,null,"2025-12-04"]
[null,null,null,"",{"$f":"IF(CALC!$B$1=\"MR26\",Q27,P27)","v":"00:00:00"},"",0,0,0,null,null,null,null,null,null,"2026-06-04"]
[null,null,null,"",{"$f":"IF(CALC!$B$1=\"MR26\",Q28,P28)","v":"00:00:00"},"",0,0,0,null,null,null,null,null,null,"2026-12-03"]
[null,null,null,"",{"$f":"IF(CALC!$B$1=\"MR26\",Q29,P29)","v":"00:00:00"},"",0,0,0,null,null,null,null,null,null,"2027-06-03"]
[null,null,null,"",{"$f":"IF(CALC!$B$1=\"MR26\",Q30,P30)","v":"00:00:00"},"",0,0,0,null,null,null,null,null,null,"2027-12-02"]
[null,null,null,"",{"$f":"IF(CALC!$B$1=\"MR26\",Q31,P31)","v":"00:00:00"},"",0,0,0,null,null,null,null,null,null,"2028-06-01"]
[null,null,null,"",{"$f":"IF(CALC!$B$1=\"MR26\",Q32,P32)","v":"00:00:00"},"",0,0,0,null,null,null,null,null,null,"2028-11-30"]
[null,null,null,"",{"$f":"IF(CALC!$B$1=\"MR26\",Q33,P33)","v":"00:00:00"},"",0,0,0,null,null,null,null,null,null,"2029-05-31"]
[null,null,null,"",{"$f":"IF(CALC!$B$1=\"MR26\",Q34,P34)","v":"00:00:00"},{"$f":"IF(OR(E34-$B$1<=0,E34>$B$2),\"\",E34-$B$1)","v":""},0,0,0,null,null,null,null,null,null,"2029-11-29"]
[null,null,null,{"$f":"IF(F35=MIN($F:$F),\"VIG\",\"\")","v":""},{"$f":"IF(CALC!$B$1=\"MR26\",Q35,P35)","v":"00:00:00"},"",0,{"$f":"IF(F35<=0,0,IF(F35=MAX($F:$F),$B$3/36000*G35*100+100,$B$3/36000*G35*100))","v":0},{"$f":"IF(F35=\"\",0,H35/(1+$B$4*182/36000)^(F35/182))","v":0},null,null,null,null,null,null,"2030-05-30"]
[null,null,null,"",{"$f":"IF(CALC!$B$1=\"MR26\",Q36,P36)","v":"00:00:00"},"",0,0,0,null,null,null,null,null,null,"2030-11-28"]
[null,null,null,"",{"$f":"IF(CALC!$B$1=\"MR26\",Q37,P37)","v":"00:00:00"},"",0,0,0,null,null,null,null,null,null,"2031-05-29"]
[null,null,null,"",{"$f":"IF(CALC!$B$1=\"MR26\",Q38,P38)","v":"00:00:00"},"",0,0,0,null,null,null,null,null,null,"2031-11-27"]
[null,null,null,"",{"$f":"IF(CALC!$B$1=\"MR26\",Q39,P39)","v":"00:00:00"},"",0,0,0,null,null,null,null,null,null,"2032-05-27"]
[null,null,null,"",{"$f":"IF(CALC!$B$1=\"MR26\",Q40,P40)","v":"00:00:00"},"",0,0,0,null,null,null,null,null,null,"2032-11-25"]
{"$rows_left_out":21}
{"sheet":"Información","index":2,"n_rows":2000,"n_cols":9,"rows_kept":2000,"cut":false,"hidden":false,"merged":[]}
[1,4.79,null,null,"Contrato","Vencimiento","Cupón","Contrato","Vencimiento"]
[2,4.7935100000000004,null,null,"DC18","2018-12-13",8.5,"DC16","2016-12-30"]
[3,4.797231,null,null,"JN21","2021-06-10",6.5,"MR17","2017-03-31"]
[4,4.8009519999999997,null,null,"DC24","2024-12-05",10,"JN17","2017-06-30"]
[5,4.804462,null,null,"MR26","2026-03-05",5.75,"SP17","2017-09-29"]
[6,4.8075489999999999,null,null,"MY31","2031-05-29",7.75]
[7,4.8099999999999996,null,null,"NV42","2042-11-13",7.75]
[8,4.8118949999999998]
[9,4.8135050000000001]
[10,4.814908]
[11,4.8161810000000003]
[12,4.8174020000000004]
[13,4.8186489999999997]
[14,4.82]
[15,4.820379]
[16,4.8193590000000004]
[17,4.8179879999999997]
[18,4.8173180000000002]
[19,4.818397]
[20,4.8222740000000002]
[21,4.83]
[22,4.842174]
[23,4.8576540000000001]
[24,4.874879]
[25,4.8922869999999996]
[26,4.9083180000000004]
[27,4.9214089999999997]
[28,4.93]
[29,4.9356859999999996]
[30,4.9411069999999997]
[31,4.9462710000000003]
[32,4.9511830000000003]
[33,4.955851]
[34,4.96028]
[35,4.9644769999999996]
[36,4.9684489999999997]
[37,4.9722020000000002]
[38,4.9757429999999996]
[39,4.9790780000000003]
[40,4.9822129999999998]
{"$rows_left_out":1961}
{"sheet":"FUTUROS ESPECIFICOS","index":3,"n_rows":58,"n_cols":21,"rows_kept":58,"cut":false,"hidden":false,"merged":[[1,15,1,16],[3,15,3,16]]}
["Contrato","YCash Bid","YFut Bid","Bid","Ask","Y F Ask","YCash Ask","Last","Tasa Fut","Tasa Cash",null,"BID","ASK","LAST",null,null,null,null,"Plazos","DXV","Fondeo"]
[{"$f":"\"DC18 \"&Información!$H$2","v":"DC18 DC16"},null,null,null,null,null,null,null,null,null,null,{"$f":"_xll.rtdValue(L$1,$A2,\"EMD\",\"MXN\")","v":""},{"$f":"_xll.rtdValue(M$1,$A2,\"EMD\",\"MXN\")","v":""},{"$f":"_xll.rtdValue(N$1,$A2,\"EMD\",\"MXN\")","v":""},null,"Fecha Valuación",null,null,{"$f":"+Información!H2","v":"DC16"},{"$f":"VLOOKUP(S2,CTOS_FUT,2,0)-'FUTUROS ESPECIFICOS'!$P$4","v":50},{"$f":"VLOOKUP(T2,Información!$A:$B,2,0)","v":5.0040339999999999}]
[null,null,null,null,null,null,null,null,null,null,null,null,null,null,null,null,null,null,null,null,3.22]
[{"$f":"\"DC18 \"&Información!$H$3","v":"DC18 MR17"},null,null,null,null,null,null,null,null,null,null,{"$f":"_xll.rtdValue(L$1,$A4,\"EMD\",\"MXN\")","v":""},{"$f":"_xll.rtdValue(M$1,$A4,\"EMD\",\"MXN\")","v":""},{"$f":"_xll.rtdValue(N$1,$A4,\"EMD\",\"MXN\")","v":""},null,{"$f":"WORKDAY(TODAY(),2,calendario!$A$1:$A$339)","v":"2016-11-10"},null,null,{"$f":"+Información!H3","v":"MR17"},{"$f":"VLOOKUP(S4,CTOS_FUT,2,0)-'FUTUROS ESPECIFICOS'!$P$4","v":141},{"$f":"VLOOKUP(T4,Información!$A:$B,2,0)","v":5.1145649999999998}]
[null,null,null,null,null,null,null,null,null,null,null,null,null,null,null,null,null,null,null,null,3.3458807199999998]
[{"$f":"\"DC18 \"&Información!$H$4","v":"DC18 JN17"},null,null,null,null,null,null,null,null,null,null,{"$f":"_xll.rtdValue(L$1,$A6,\"EMD\",\"MXN\")","v":""},{"$f":"_xll.rtdValue(M$1,$A6,\"EMD\",\"MXN\")","v":""},{"$f":"_xll.rtdValue(N$1,$A6,\"EMD\",\"MXN\")","v":""},null,null,null,null,{"$f":"+Información!H4","v":"JN17"},{"$f":"VLOOKUP(S6,CTOS_FUT,2,0)-'FUTUROS ESPECIFICOS'!$P$4","v":232},{"$f":"VLOOKUP(T6,Información!$A:$B,2,0)","v":5.2644289999999998}]
[null,null,null,null,null,null,null,null,null,null,null,null,null,null,null,null,null,null,null,null,3.59151833]
[{"$f":"\"DC18 \"&Información!$H$5","v":"DC18 SP17"},null,null,null,null,null,null,null,null,null,null,{"$f":"_xll.rtdValue(L$1,$A8,\"EMD\",\"MXN\")","v":""},{"$f":"_xll.rtdValue(M$1,$A8,\"EMD\",\"MXN\")","v":""},{"$f":"_xll.rtdValue(N$1,$A8,\"EMD\",\"MXN\")","v":""},null,null,null,null,{"$f":"+Información!H5","v":"SP17"},{"$f":"VLOOKUP(S8,CTOS_FUT,2,0)-'FUTUROS ESPECIFICOS'!$P$4","v":323},{"$f":"VLOOKUP(T8,Información!$A:$B,2,0)","v":5.4105379999999998}]
[null,null,null,null,null,null,null,null,null,null,null,null,null,null,null,null,null,null,null,null,3.6003676699999998]
[]
[]
[{"$f":"\"JN21 \"&Información!$H$2","v":"JN21 DC16"},null,null,null,null,null,null,null,null,null,null,{"$f":"_xll.rtdValue(L$1,$A12,\"EMD\",\"MXN\")","v":""},{"$f":"_xll.rtdValue(M$1,$A12,\"EMD\",\"MXN\")","v":""},{"$f":"_xll.rtdValue(N$1,$A12,\"EMD\",\"MXN\")","v":""}]
[]
[{"$f":"\"JN21 \"&Información!$H$3","v":"JN21 MR17"},null,null,null,null,null,null,null,null,null,null,{"$f":"_xll.rtdValue(L$1,$A14,\"EMD\",\"MXN\")","v":""},{"$f":"_xll.rtdValue(M$1,$A14,\"EMD\",\"MXN\")","v":""},{"$f":"_xll.rtdValue(N$1,$A14,\"EMD\",\"MXN\")","v":""}]
[]
[{"$f":"\"JN21 \"&Información!$H$4","v":"JN21 JN17"},null,null,null,null,null,null,null,null,null,null,{"$f":"_xll.rtdValue(L$1,$A16,\"EMD\",\"MXN\")","v":""},{"$f":"_xll.rtdValue(M$1,$A16,\"EMD\",\"MXN\")","v":""},{"$f":"_xll.rtdValue(N$1,$A16,\"EMD\",\"MXN\")","v":""}]
[]
[{"$f":"\"JN21 \"&Información!$H$5","v":"JN21 SP17"},null,null,null,null,null,null,null,null,null,null,{"$f":"_xll.rtdValue(L$1,$A18,\"EMD\",\"MXN\")","v":""},{"$f":"_xll.rtdValue(M$1,$A18,\"EMD\",\"MXN\")","v":""},{"$f":"_xll.rtdValue(N$1,$A18,\"EMD\",\"MXN\")","v":""}]
[]
[]
[]
[{"$f":"\"DC24 \"&Información!$H$2","v":"DC24 DC16"},null,null,null,null,null,null,null,null,null,null,{"$f":"_xll.rtdValue(L$1,$A22,\"EMD\",\"MXN\")","v":""},{"$f":"_xll.rtdValue(M$1,$A22,\"EMD\",\"MXN\")","v":""},{"$f":"_xll.rtdValue(N$1,$A22,\"EMD\",\"MXN\")","v":""}]
[]
[{"$f":"\"DC24 \"&Información!$H$3","v":"DC24 MR17"},null,null,null,null,null,null,null,null,null,null,{"$f":"_xll.rtdValue(L$1,$A24,\"EMD\",\"MXN\")","v":""},{"$f":"_xll.rtdValue(M$1,$A24,\"EMD\",\"MXN\")","v":""},{"$f":"_xll.rtdValue(N$1,$A24,\"EMD\",\"MXN\")","v":""}]
[]
[{"$f":"\"DC24 \"&Información!$H$4","v":"DC24 JN17"},null,null,null,null,null,null,null,null,null,null,{"$f":"_xll.rtdValue(L$1,$A26,\"EMD\",\"MXN\")","v":""},{"$f":"_xll.rtdValue(M$1,$A26,\"EMD\",\"MXN\")","v":""},{"$f":"_xll.rtdValue(N$1,$A26,\"EMD\",\"MXN\")","v":""}]
[]
[{"$f":"\"DC24 \"&Información!$H$5","v":"DC24 SP17"},null,null,null,null,null,null,null,null,null,null,{"$f":"_xll.rtdValue(L$1,$A28,\"EMD\",\"MXN\")","v":""},{"$f":"_xll.rtdValue(M$1,$A28,\"EMD\",\"MXN\")","v":""},{"$f":"_xll.rtdValue(N$1,$A28,\"EMD\",\"MXN\")","v":""}]
[]
[]
[]
[{"$f":"\"MR26 \"&Información!$H$2","v":"MR26 DC16"},null,null,null,null,null,null,null,null,null,null,{"$f":"_xll.rtdValue(L$1,$A32,\"EMD\",\"MXN\")","v":""},{"$f":"_xll.rtdValue(M$1,$A32,\"EMD\",\"MXN\")","v":""},{"$f":"_xll.rtdValue(N$1,$A32,\"EMD\",\"MXN\")","v":""}]
[]
[{"$f":"\"MR26 \"&Información!$H$3","v":"MR26 MR17"},null,null,null,null,null,null,null,null,null,null,{"$f":"_xll.rtdValue(L$1,$A34,\"EMD\",\"MXN\")","v":""},{"$f":"_xll.rtdValue(M$1,$A34,\"EMD\",\"MXN\")","v":""},{"$f":"_xll.rtdValue(N$1,$A34,\"EMD\",\"MXN\")","v":""}]
[]
[{"$f":"\"MR26 \"&Información!$H$4","v":"MR26 JN17"},null,null,null,null,null,null,null,null,null,null,{"$f":"_xll.rtdValue(L$1,$A36,\"EMD\",\"MXN\")","v":""},{"$f":"_xll.rtdValue(M$1,$A36,\"EMD\",\"MXN\")","v":""},{"$f":"_xll.rtdValue(N$1,$A36,\"EMD\",\"MXN\")","v":""}]
[]
[{"$f":"\"MR26 \"&Información!$H$5","v":"MR26 SP17"},null,null,null,null,null,null,null,null,null,null,{"$f":"_xll.rtdValue(L$1,$A38,\"EMD\",\"MXN\")","v":""},{"$f":"_xll.rtdValue(M$1,$A38,\"EMD\",\"MXN\")","v":""},{"$f":"_xll.rtdValue(N$1,$A38,\"EMD\",\"MXN\")","v":""}]
[]
[]
{"$rows_left_out":19}
{"sheet":"calendario","index":4,"n_rows":339,"n_cols":1,"rows_kept":339,"cut":false,"hidden":true,"merged":[]}
["2015-01-01"]
["2015-02-02"]
["2015-03-16"]
["2015-04-02"]
["2015-04-03"]
["2015-05-01"]
["2015-09-16"]
["2015-11-02"]
["2015-11-16"]
["2015-12-25"]
["2016-01-01"]
["2016-02-01"]
["2016-03-21"]
["2016-03-24"]
["2016-03-25"]
["2016-09-16"]
["2016-11-02"]
["2016-11-21"]
["2016-12-12"]
["2017-02-06"]
["2017-03-20"]
["2017-04-13"]
["2017-04-14"]
["2017-05-01"]
["2017-11-02"]
["2017-11-20"]
["2017-12-12"]
["2017-12-25"]
["2018-01-01"]
["2018-02-05"]
["2018-03-19"]
["2018-03-29"]
["2018-03-30"]
["2018-05-01"]
["2018-11-02"]
["2018-11-19"]
["2018-12-12"]
["2018-12-25"]
["2019-01-01"]
["2019-02-04"]
{"$rows_left_out":299}